program: Gaussian 09
title: 000299392
version: EM64L-G09RevD.01
frameworkgroup: C1[X(C23H25NO5)]
method: RPBEPBE
basis: SDD
operation: Freq
keyword: #p
keyword: freq=noraman
keyword: PBEPBE/SDD
title: #p freq=noraman PBEPBE/SDD
converged: NO YES NO NO
title: Mulliken charges:
elementType: O O O O O N C C C C C C C C C C C C C C C C C C C C C C C H H H H H H H H H H H H H H H H H H H H H H H H H
charge: -0.252934 -0.196050 -0.204363 -0.215438 -0.198872 0.034810 0.314950 0.308607 -0.398744 -0.543192 -0.546231 0.098362 0.100145 0.114979 0.122713 -0.552520 -0.550247 0.046763 0.043897 -0.736850 -0.740227 -0.725421 -0.738838 0.489760 0.184596 -0.355223 -0.374623 -0.244169 -0.230658 0.351625 0.242154 0.247675 0.244448 0.245296 0.239321 0.245915 0.236711 0.250283 0.239683 0.210896 0.223638 0.225956 0.216358 0.213473 0.210494 0.222391 0.236526 0.226599 0.217126 0.211623 0.234441 0.284351 0.231258 0.236775
chargesum: 0.00000
title: Mulliken charges with hydrogens summed into heavy atoms:
elementType: O O O O O N C C C C C C C C C C C C C C C C C C C C C C C
charge: -0.252934 -0.196050 -0.204363 -0.215438 -0.198872 0.034810 0.314950 0.308607 -0.047119 -0.053364 -0.056487 0.098362 0.100145 0.114979 0.122713 -0.067284 -0.063253 0.046763 0.043897 -0.062632 -0.084440 -0.056010 -0.083490 0.489760 0.184596 -0.120782 -0.090272 -0.012911 0.006117
polarizability: 2.67320397e+02 -3.98314229e+00 3.20362615e+02 3.32053196e+00 -3.04671749e+00 2.27176813e+02
1716.lowfreq: -3.0495 -0.0008 -0.0006 -0.0005 4.1374 6.4431 15.6112 32.4592 37.5740
frequency: 15.5684 32.4166 37.5505 43.6841 62.1108 68.4388 82.3265 99.8597 113.4732 118.7380 124.3968 132.7995 179.3923 185.4086 198.0728 214.6397 223.6660 228.9424 240.8214 246.9522 266.3442 278.3530 283.5191 294.7836 302.6816 308.0017 333.0874 339.2055 355.5890 368.9592 387.2412 397.3428 416.3314 424.6330 442.5461 466.8249 470.6902 479.3759 516.0590 530.7972 542.4025 545.3027 561.3104 574.3908 588.8201 604.3204 626.7213 649.5307 655.4803 670.5122 687.4319 726.7609 770.8695 778.6821 784.1078 793.8105 798.5431 821.2820 838.9943 884.1679 885.1659 886.5043 906.4382 919.2933 924.9480 933.5705 938.5894 940.6492 965.2193 969.1154 977.7056 992.7925 995.6054 1000.6462 1012.0689 1013.9206 1042.0712 1054.6416 1076.5707 1109.2304 1124.2711 1126.0125 1129.2455 1131.8603 1148.5892 1156.4842 1165.6547 1173.2315 1189.5644 1192.5936 1203.1484 1210.4827 1236.5766 1251.3032 1258.0009 1267.4281 1281.0353 1282.2780 1292.3529 1292.6932 1298.9224 1320.6320 1328.8829 1350.9405 1363.6393 1377.2475 1379.8094 1380.0776 1391.6330 1398.3390 1399.1558 1432.1644 1433.3929 1440.1068 1444.1990 1444.6891 1465.4897 1465.5608 1468.9689 1469.9816 1471.5669 1482.7594 1484.2710 1487.4452 1489.3679 1569.6113 1577.1090 1583.3004 1607.7923 1629.6666 1665.2721 2959.6653 2961.3895 2961.9138 2964.3584 2968.9035 2970.0081 2977.7806 2979.2698 3029.4818 3032.1564 3042.5324 3057.8128 3058.6136 3063.4254 3064.4424 3070.8585 3071.2433 3073.6802 3075.6260 3077.8411 3081.0297 3120.0713 3142.3739 3162.3468 3187.8065
redmass: 9.3825 4.3620 5.4728 4.4098 5.5191 4.0166 4.9456 5.0970 4.9698 4.4732 4.1776 4.1796 5.7536 4.4580 1.1604 1.0454 1.8623 3.2783 3.9588 1.5264 1.6714 1.8423 2.0638 4.5789 3.2476 7.8371 2.4170 3.0261 2.5727 2.3464 8.1917 2.2380 2.5934 3.6743 4.1796 4.1909 4.4501 4.0871 5.0772 4.5742 4.1222 4.3953 5.1293 4.7716 4.3388 5.5843 5.8633 4.5806 5.0375 4.6849 5.8266 3.3143 5.6172 1.8675 3.5110 3.9394 2.9899 4.9226 4.9207 1.6810 1.8115 1.6041 2.4331 2.0469 2.0819 1.7169 1.4333 1.4362 2.2247 1.4041 1.9617 3.7973 1.3433 3.0904 1.4692 1.4904 3.9135 2.7013 3.1354 2.2972 2.0060 1.8665 1.9167 2.0245 1.3893 1.9079 2.0962 1.1575 2.3062 2.1369 5.2515 3.2285 1.6055 2.3848 2.5642 2.3615 1.6987 1.7362 1.8901 1.8642 1.5063 2.2969 1.8452 2.4189 3.8416 4.0532 1.2023 1.2051 6.1330 1.2051 1.2038 1.0863 1.0884 2.3773 1.0869 1.0901 1.0490 1.0491 2.5041 1.0612 1.0631 1.0588 1.0589 1.0595 1.0595 10.9394 10.8616 6.5235 6.6912 8.8267 9.3678 1.0641 1.0649 1.0627 1.0640 1.0368 1.0360 1.0368 1.0365 1.0953 1.0948 1.0821 1.0944 1.0948 1.0994 1.0994 1.0996 1.0995 1.0991 1.0988 1.0988 1.0991 1.0869 1.0907 1.0957 1.0956
irintensity: 0.3936 0.2970 0.9845 1.0085 0.7365 0.1618 0.3401 3.7539 0.5245 0.3752 0.8954 0.4333 1.2272 8.1632 0.4306 0.0553 1.0815 1.1666 1.0893 0.4090 3.4854 2.7434 6.2425 0.4192 0.8162 0.5332 1.0533 1.0217 3.0472 0.1455 2.6407 1.3930 0.3053 0.0826 7.4083 0.2239 0.2291 3.2210 5.0156 7.8979 19.0203 3.0501 4.8998 0.6389 7.8403 0.5036 6.2759 8.1758 5.3589 18.2812 4.5058 4.3686 7.5167 21.7965 15.1548 7.5236 28.8722 13.6529 9.5067 1.7244 6.5067 0.1141 0.8823 3.1066 15.6065 2.5961 1.4700 2.6232 3.3606 0.4445 10.0289 4.6769 1.7449 127.8546 12.0619 13.8737 0.7154 7.3874 11.5782 16.8905 230.1682 70.0683 15.5853 8.3260 13.1545 89.6440 19.2651 8.6340 47.1759 66.0996 140.9571 27.3058 40.1897 45.6059 8.9414 112.3652 0.7691 2.6220 5.4817 1.5452 58.1972 9.0118 28.2428 183.9253 3.0299 88.2580 24.0191 16.2588 15.4246 18.9644 11.9594 7.7443 7.5885 14.6620 2.8343 12.9697 2.2529 2.4406 34.0655 10.3605 12.6711 7.7384 6.9369 12.6238 10.8260 15.5834 271.5875 24.4934 12.2139 63.8189 110.4732 13.0963 15.1047 14.4458 14.0275 45.3238 39.4412 18.2686 20.6237 7.6099 10.2533 58.6639 7.7462 7.0553 24.5954 31.7400 12.4681 11.7062 40.1810 47.8021 51.1543 43.3149 8.1506 12.4043 18.3129 6.9470
temp: 298.150 k
press: 1.00000 atm
elementType: 8 8 8 8 8 7 6 6 6 6 6 6 6 6 6 6 6 6 6 6 6 6 6 6 6 6 6 6 6 1 1 1 1 1 1 1 1 1 1 1 1 1 1 1 1 1 1 1 1 1 1 1 1 1
symmnumber: 1
zpe: 1131244.1 jmol-1
zpe.correction: 0.430868 hartree
zpe.thermalcorrener: 0.457871 hartree
zpe.thermalcorrenthalpy: 0.458815 hartree
zpe.thermalcorrgfe: 0.373789 hartree
zpe.sumelectzpe: -1320.116027 hartree
zpe.sumelectthermal: -1320.089024 hartree
zpe.sumelectthermalent: -1320.088080 hartree
zpe.sumelectthermalfe: -1320.173107 hartree
dipole: 0.6976 -8.7881 5.5937
dipole: 10.4406
quadrupole: -156.6335 -177.3131 -169.6579
quadrupole: 3.8048 -0.3959 19.2966
quadrupole: 11.2347 -9.4450 -1.7897 3.8048 -0.3959 19.2966
hfenergy: -1320.5468955 hartree
pointgroup: C01 [X(C23H25N1O5)]
dipole: 0.1576789 -3.3577053 -2.3608877 debye
polarizability: 267.0347704|-2.4534509|320.0348944|3.3453616|7.7900808|227.7901604 unknown
InChI: InChI=1S/C23H25NO5/c1-22(2)9-15(25)20-17(11-22)29-18-12-23(3,4)10-16(26)21(18)19(20)13-7-5-6-8-14(13)24(27)28/h5-8,19H,9-12H2,1-4H3
charge 0 multiplicity 1
54 atoms
O  0.407027 -2.516102 -0.349681
O  -2.721473 0.781658 1.289433
O  2.478338 1.738514 0.61208
O  -0.120966 4.590093 1.656531
O  -0.13241 2.461628 2.421158
N  -0.214841 3.315328 1.460199
C  -3.352914 -2.591938 -0.124386
C  4.034501 -1.569216 -0.061082
C  0.00794 0.288515 0.547328
C  -1.900729 -3.149469 -0.045034
C  2.788688 -2.281692 -0.668768
C  -1.088914 -0.775736 0.484937
C  1.349891 -0.31616 0.130192
C  -0.869618 -2.056857 0.051914
C  1.497485 -1.618299 -0.269915
C  -3.513337 -1.509913 0.980987
C  3.881535 -0.040634 -0.301767
C  -2.454995 -0.404963 0.930392
C  2.556795 0.543594 0.193256
C  -3.620845 -1.974376 -1.52281
C  -4.355173 -3.744849 0.124022
C  4.135993 -1.863556 1.459159
C  5.310698 -2.084538 -0.768559
C  -0.346993 1.493191 -0.352238
C  -0.43965 2.852711 0.056841
C  -0.574619 1.224636 -1.725869
C  -0.758453 3.880847 -0.86204
C  -0.895085 2.237073 -2.65177
C  -0.991261 3.577631 -2.215462
H  0.083183 0.667221 1.579795
H  -1.673596 -3.77826 -0.927046
H  -1.803081 -3.810845 0.841708
H  2.755419 -3.343079 -0.357763
H  2.864346 -2.282505 -1.776743
H  -3.43958 -1.9924 1.979166
H  -4.507563 -1.031031 0.929628
H  3.944849 0.168663 -1.391434
H  4.700829 0.523196 0.179289
H  -2.919053 -1.153132 -1.754869
H  -3.526402 -2.741894 -2.313601
H  -4.645216 -1.561984 -1.571437
H  -5.396235 -3.377389 0.066024
H  -4.237438 -4.542178 -0.634114
H  -4.210393 -4.198556 1.122753
H  4.267588 -2.946735 1.639186
H  5.005342 -1.338821 1.895706
H  3.235689 -1.53169 2.006267
H  6.211905 -1.597846 -0.35254
H  5.42547 -3.176648 -0.632315
H  5.283478 -1.876449 -1.855093
H  -0.495206 0.186158 -2.069509
H  -0.81259 4.907518 -0.492432
H  -1.06873 1.983763 -3.703465
H  -1.242331 4.378105 -2.918607
