program: Gaussian 09
title: 000299286
version: EM64L-G09RevD.01
frameworkgroup: C1[X(C11H9Cl2NO2S)]
method: RPBEPBE
basis: SDD
operation: Freq
keyword: #p
keyword: freq=noraman
keyword: PBEPBE/SDD
title: #p freq=noraman PBEPBE/SDD
converged: YES YES NO NO
title: Mulliken charges:
elementType: Cl Cl S O O N C C C C C C C C C C C H H H H H H H H H
charge: -0.011114 -0.046706 -0.042734 -0.245676 -0.186274 -0.404545 0.253011 0.533801 0.173059 -0.318145 -0.257987 -0.456713 -0.325996 -0.714260 0.166668 -0.190406 -0.217710 0.319823 0.261271 0.256959 0.233618 0.275099 0.275671 0.283078 0.265595 0.120612
chargesum: 0.00000
title: Mulliken charges with hydrogens summed into heavy atoms:
elementType: Cl Cl S O O N C C C C C C C C C C C
charge: -0.011114 -0.046706 0.077878 -0.245676 -0.186274 -0.084722 0.253011 0.533801 0.173059 0.200086 -0.024369 -0.456713 -0.050897 -0.155512 0.166668 -0.190406 0.047885
polarizability: 2.41223928e+02 -2.60010306e+01 2.17474483e+02 9.56817706e-01 -1.37216472e+00 8.01757841e+01
1716.lowfreq: 0.0007 0.0026 0.0031 2.2902 5.7869 7.6998 23.6125 38.0513 56.8231
frequency: 23.5457 38.0372 56.8169 71.9385 78.0975 130.5459 152.0194 161.8360 177.7516 181.9289 247.6177 248.4805 275.0893 286.7543 319.2446 338.6387 343.4799 393.3724 402.9086 441.6487 503.1273 526.9120 569.6947 591.7813 610.1360 617.8596 634.9894 642.0543 678.2413 698.7250 729.7134 806.8506 824.0965 824.8043 838.6101 850.2448 870.6725 896.7460 954.3904 997.7346 1017.1681 1071.5132 1089.1800 1120.2356 1134.0935 1175.0024 1199.8375 1228.0048 1249.4881 1263.8196 1296.0789 1320.5262 1360.4492 1395.4025 1406.1707 1441.4842 1458.7026 1471.6840 1529.2818 1557.3902 1605.6918 1610.6309 1680.6383 2451.1828 2998.3092 3044.2182 3087.7702 3125.9929 3154.1128 3168.7812 3187.3152 3456.3705
redmass: 10.1410 6.5725 6.6316 4.1733 7.8989 6.1292 8.3200 5.3092 2.4741 2.0522 7.4414 2.3660 9.6822 9.0316 13.4444 6.5539 6.2314 3.7852 6.7623 3.3726 7.9858 3.9559 7.4426 6.0214 2.7479 1.5904 4.8943 6.5226 8.6270 7.4810 4.4048 4.5657 1.4322 1.1443 2.2926 1.5487 9.1407 5.9185 1.3373 2.0881 2.0644 2.8625 2.0366 1.7708 4.5105 1.4413 2.2692 1.4129 3.1708 1.4858 1.1983 1.7986 1.6636 7.5647 3.6251 1.1014 2.5980 1.0824 1.6547 7.2179 9.0818 6.8205 12.7058 1.0387 1.0668 1.0579 1.0962 1.1093 1.0916 1.0889 1.0982 1.0752
irintensity: 0.2898 1.0766 3.5997 2.9433 1.2917 3.5697 0.2404 0.5346 4.8143 14.6163 4.2557 1.7288 0.7815 0.8787 0.4114 1.7550 2.9038 1.9760 0.1010 1.0891 9.2043 8.6383 13.9413 3.6270 17.3392 43.1349 25.6116 6.2051 14.6296 44.0342 13.3867 48.4499 50.5483 1.5986 5.0069 18.9698 196.2346 3.0261 0.4840 15.5609 21.6320 9.9943 20.0680 21.8479 4.1804 18.6077 35.3738 20.2627 24.4200 15.3881 18.1097 16.4515 0.7420 28.3703 12.9890 11.9411 82.8960 36.8555 270.4560 232.5415 95.1826 99.6740 579.9240 15.7217 27.7959 15.2578 7.7473 12.6299 0.7174 0.2024 0.6988 166.6627
temp: 298.150 k
press: 1.00000 atm
elementType: 17 17 16 8 8 7 6 6 6 6 6 6 6 6 6 6 6 1 1 1 1 1 1 1 1 1
symmnumber: 1
zpe: 462916.9 jmol-1
zpe.correction: 0.176316 hartree
zpe.thermalcorrener: 0.192843 hartree
zpe.thermalcorrenthalpy: 0.193787 hartree
zpe.thermalcorrgfe: 0.129987 hartree
zpe.sumelectzpe: -1946.715778 hartree
zpe.sumelectthermal: -1946.699250 hartree
zpe.sumelectthermalent: -1946.698306 hartree
zpe.sumelectthermalfe: -1946.762106 hartree
dipole: -1.5859 6.2117 1.8156
dipole: 6.6631
quadrupole: -121.1594 -130.8722 -120.7352
quadrupole: 21.8579 2.9912 8.0175
quadrupole: 3.0962 -6.6166 3.5204 21.8579 2.9912 8.0175
hfenergy: -1946.8920934 hartree
pointgroup: C01 [X(C11H9Cl2N1O2S1)]
dipole: -0.6948881 -2.4514858 0.6159695 debye
dipolederiv: -0.6327145 0.3351118 -0.0411699 0.1573524 -0.2144709 0.0078439 -0.0462931 0.0522293 -0.0258232 -0.1962889 0.1623923 0.0074209 0.3227128 -0.7642149 -0.0294077 0.0109565 -0.0252172 -0.059878 -0.3081282 -0.0822005 0.0311827 -0.1014087 -0.2621676 -0.1378961 0.0185016 -0.1560628 0.0867074 -0.9648614 0.596961 0.0280825 0.3662741 -1.0179778 -0.0519326 0.0070505 -0.0668156 -0.1990162 -0.4543571 0.0462353 0.0050366 0.0941739 -1.6036106 -0.0856808 0.0164385 -0.0786688 -0.325816 -0.9944206 -0.6553837 -0.0451437 -0.7495924 -1.1105962 0.0689393 -0.056199 0.0395666 -0.3760493 -0.1741692 -0.2100517 0.0086832 0.1000435 -0.1330145 -0.0071352 0.046878 0.041893 -0.01303 0.7228968 0.5740071 0.0059558 0.7844548 1.3238628 0.0030544 0.0737698 0.1008196 0.1836478 0.0869479 -0.1108131 -0.015576 -0.3210576 0.8079061 0.0441736 -0.0387061 0.0641793 0.1194811 0.6947133 0.2788282 0.0373207 -0.0197743 0.0242753 -0.0406779 -0.0375823 -0.1735719 0.2158506 -0.0077793 0.0545224 -0.0086995 -0.0040939 -0.1920064 -0.004429 -0.0074296 -0.0010995 -0.0946917 0.5388554 -0.7551606 0.0882768 -0.7041423 -0.9084064 -0.0590525 0.0582575 -0.199279 -0.1978567 0.0884369 0.1010067 0.0114434 0.0363844 -0.0398409 0.0073092 0.0088119 -0.0029916 -0.1475663 0.0595202 -0.1010658 -0.0330486 0.0069083 0.4085981 0.2507513 -0.0183078 0.1734264 0.1136333 1.1709421 -0.0386699 -0.0242087 -0.0169156 2.2274808 0.1467841 -0.0158357 0.160217 0.3016696 -0.028212 -0.1807336 -0.0062984 -0.524388 1.1596968 0.0474381 -0.0170062 0.0395653 -0.0746572 0.0374265 0.0372486 0.0018155 0.2641697 -0.2982056 -0.004964 0.0069148 0.0023618 -0.0972423 0.2506924 0.067333 0.0272561 0.270783 0.4034688 -0.031434 0.0441685 -0.058053 0.2317215 0.0320865 -0.0725818 -0.0084785 0.0582503 0.0067397 -0.088322 0.0349017 -0.0075153 0.0335001 -0.1159433 -0.0697934 -0.0420982 0.0391616 0.0759204 0.0310255 -0.0796255 0.0689168 -0.0408643 0.044547 -0.0829986 -0.0061477 -0.0708587 0.0444169 -0.0003485 -0.0020068 0.005096 0.1442489 0.0548923 -0.0311182 -0.0019493 -0.0615234 0.0248013 -0.0085568 -0.0046813 -0.0111395 0.1730041 0.0810464 0.0749785 -0.0806615 0.0217628 -0.0192245 -0.0312959 -0.0496056 -0.0333922 -0.0887684 -0.1120081 -0.0104219 0.0595721 -0.0121444 -0.0134572 -0.0608197 0.055766 -0.0478176 0.0548044 -0.0159955 0.0339329 0.0014111 0.0517322 0.0908217 -0.0035739 0.0029224 -0.00547 0.1655588 0.1418744 0.0384348 0.0000227 0.0117355 -0.020795 0.0382074 -0.0120587 0.118823 -0.0825678 unknown
polarizability: 212.5043606|-23.0642201|245.7845059|-1.1664928|8.4034144|80.5853288 unknown
InChI: InChI=1S/C11H9Cl2NO2S/c12-6-1-2-8-7(5-6)10(14-3-4-17)9(13)11(15)16-8/h1-2,5,14,17H,3-4H2
charge 0 multiplicity 1
26 atoms
Cl -2.700361 2.438766 -0.145159
Cl 2.820402 -3.575671 -0.16271
S  -3.239095 -3.347255 -0.555766
O  1.36956 2.234227 0.144574
O  -0.133951 3.973922 0.231934
N  -1.757329 -0.649508 -0.092811
C  0.609631 -0.104904 -0.022955
C  -0.805242 0.34102 -0.025985
C  1.640389 0.87325 0.041904
C  -3.204011 -0.610619 0.187865
C  0.99702 -1.474922 -0.076864
C  -1.032813 1.723264 0.02994
C  3.007145 0.514074 0.025984
C  -3.661359 -1.981053 0.718761
C  -0.000684 2.741104 0.148423
C  2.355261 -1.815438 -0.092524
C  3.376175 -0.839419 -0.045898
H  -1.447819 -1.582608 -0.386467
H  -3.418879 0.146697 0.958448
H  -3.78462 -0.334489 -0.713257
H  0.261577 -2.284429 -0.092271
H  3.757605 1.307477 0.074631
H  -3.145367 -2.225833 1.660808
H  -4.750642 -1.97993 0.874741
H  4.428775 -1.133835 -0.058991
H  -3.039667 -4.364585 0.360547
