program: Gaussian 09
title: 000299279
version: EM64L-G09RevD.01
frameworkgroup: C1[X(C16H15NO)]
method: RPBEPBE
basis: SDD
operation: Freq
keyword: #p
keyword: freq=noraman
keyword: PBEPBE/SDD
title: #p freq=noraman PBEPBE/SDD
converged: YES YES NO NO
title: Mulliken charges:
elementType: O N C C C C C C C C C C C C C C C C H H H H H H H H H H H H H H H
charge: -0.275286 -0.052012 0.411831 -0.516808 0.073515 -0.364100 0.005128 -0.425413 0.071938 -0.357429 -0.216475 -0.689408 0.310542 -0.360648 -0.366023 -0.228407 -0.227900 -0.235168 0.214673 0.203192 0.210564 0.224623 0.236522 0.256247 0.227230 0.211637 0.209734 0.222614 0.260108 0.271738 0.229579 0.231559 0.232103
chargesum: 0.00000
title: Mulliken charges with hydrogens summed into heavy atoms:
elementType: O N C C C C C C C C C C C C C C C C
charge: -0.275286 -0.052012 0.411831 -0.098943 0.073515 0.071086 0.005128 -0.188891 0.071938 -0.101182 0.010755 -0.045423 0.310542 -0.100540 -0.094285 0.001171 0.003660 -0.003065
polarizability: 2.99449802e+02 2.95474173e+01 2.03273435e+02 6.14768628e+00 -1.26809950e+01 8.80915419e+01
1716.lowfreq: -6.1131 -0.0003 -0.0003 -0.0001 2.5495 5.5660 34.1010 40.0772 64.6763
frequency: 34.0284 40.0240 64.6706 75.8736 93.2200 98.2788 178.8574 208.9578 222.6855 236.4985 281.2692 287.8877 305.3020 337.7620 377.1172 403.3598 484.1421 518.8879 544.8621 556.0274 588.5926 607.2805 615.2072 659.6393 684.9405 698.4304 729.7618 744.7737 748.5314 783.4796 797.1903 838.4013 847.2977 859.7903 869.2008 884.2380 906.7263 942.7481 972.3935 975.6736 988.5173 990.2950 1004.6093 1007.4397 1028.3997 1041.4197 1056.8430 1083.6475 1095.0140 1107.7676 1149.3713 1174.0673 1177.3615 1187.5524 1218.8103 1230.5550 1263.3015 1274.1346 1288.6679 1296.7960 1321.4468 1344.0209 1384.9201 1387.4848 1391.4413 1413.2035 1439.8373 1465.0121 1468.8738 1475.3759 1476.9394 1480.9764 1487.7163 1545.4456 1585.4622 1605.7673 1619.0786 1629.4701 2972.5876 2978.7016 2989.7107 3024.9717 3047.9982 3073.4388 3074.6417 3127.5777 3130.3678 3141.8373 3150.8554 3155.4071 3165.6813 3173.7991 3177.5528
redmass: 3.3350 3.6739 5.1240 1.9366 3.1931 4.3412 4.7937 3.1907 1.7645 1.9617 4.1832 3.9516 4.4498 5.4858 3.9113 2.8380 3.7810 4.5928 6.5718 4.3111 5.4828 5.6224 6.2998 5.8167 5.9332 1.7688 5.8107 1.3583 1.6619 1.9438 1.9570 4.5649 10.9251 1.2472 1.3925 1.9103 1.4221 1.4261 1.3279 7.9763 6.2618 1.3825 1.3277 2.6817 2.0700 2.4201 2.6892 1.5914 2.1019 1.6236 2.8972 1.0566 1.4326 1.1543 1.8688 2.5108 1.3649 3.5980 1.3565 1.2572 1.3408 1.4702 8.2657 1.2145 3.2909 4.1965 2.3948 2.3654 1.0961 1.0509 1.0629 3.0164 1.0914 7.3673 6.3041 7.0384 7.2337 8.0888 1.0361 1.0592 1.0601 1.1000 1.1028 1.1019 1.0993 1.0879 1.0853 1.0889 1.0924 1.0935 1.0960 1.1005 1.0974
irintensity: 0.0258 0.0703 1.7930 0.3207 0.0615 0.6326 0.2243 0.0503 0.0449 0.2286 0.0840 1.7374 0.0650 1.3984 2.7986 0.0017 4.9483 3.4742 0.0554 1.0115 2.5109 0.4896 0.3733 0.4113 19.1193 54.8890 17.6657 12.1157 32.0507 42.0007 46.9787 16.0297 24.7019 0.0525 1.2061 2.2987 1.4617 5.0701 0.9141 52.9605 1.1300 0.0252 0.4388 25.6988 3.0099 5.0047 3.4161 5.0634 15.5584 11.0965 10.4055 0.0306 10.7481 2.8125 3.0356 6.2723 0.3020 11.8626 1.3841 0.0861 2.5513 1.7404 0.5273 10.8582 4.9731 8.9862 18.4893 54.4101 0.8323 5.2224 9.4845 5.9093 18.0962 45.1582 0.4474 0.0109 3.6635 2.0262 35.1730 15.9134 49.2686 1.4217 5.9780 74.7148 47.4986 8.0344 0.3085 11.3895 21.2689 21.8608 14.3550 18.1092 13.7657
temp: 298.150 k
press: 1.00000 atm
elementType: 8 7 6 6 6 6 6 6 6 6 6 6 6 6 6 6 6 6 1 1 1 1 1 1 1 1 1 1 1 1 1 1 1
symmnumber: 1
zpe: 697878.5 jmol-1
zpe.correction: 0.265808 hartree
zpe.thermalcorrener: 0.281106 hartree
zpe.thermalcorrenthalpy: 0.282050 hartree
zpe.thermalcorrgfe: 0.221912 hartree
zpe.sumelectzpe: -747.422812 hartree
zpe.sumelectthermal: -747.407514 hartree
zpe.sumelectthermalent: -747.406570 hartree
zpe.sumelectthermalfe: -747.466708 hartree
dipole: -0.4213 1.5339 -0.1328
dipole: 1.5963
quadrupole: -85.2884 -99.5679 -110.8535
quadrupole: 3.4742 0.7190 -1.8840
quadrupole: 13.2815 -0.9980 -12.2835 3.4742 0.7190 -1.8840
hfenergy: -747.6886199 hartree
pointgroup: C01 [X(C16H15N1O1)]
dipole: 0.1509443 0.6075957 0.049562 debye
polarizability: 300.6516989|-27.3191702|202.1030648|8.141847|11.7640081|88.0600158 unknown
InChI: InChI=1S/C16H15NO/c1-2-7-12-10-6-11-14-15(12)18-16(17-14)13-8-4-3-5-9-13/h3-6,8-11H,2,7H2,1H3
charge 0 multiplicity 1
33 atoms
O  0.165436 0.394157 0.236325
N  -0.463787 -1.799996 -0.189385
C  2.666523 0.033377 0.36997
C  3.033628 1.483447 0.620513
C  1.340415 -0.394773 0.188027
C  2.918572 2.365356 -0.655344
C  0.947868 -1.737443 -0.07363
C  3.627015 -1.00681 0.269419
C  -0.89306 -0.555089 -0.005441
C  1.924884 -2.750949 -0.171431
C  3.269728 -2.359729 0.004592
C  3.292239 3.836955 -0.380673
C  -2.260861 -0.045275 -0.015872
C  -2.536302 1.330531 0.212288
C  -3.332644 -0.948848 -0.257703
C  -3.868303 1.792612 0.198179
C  -4.659828 -0.478424 -0.269933
C  -4.93335 0.89256 -0.042419
H  2.372149 1.911106 1.399711
H  4.069219 1.540219 1.006964
H  3.575768 1.949201 -1.443591
H  1.883144 2.306259 -1.042159
H  4.684644 -0.750433 0.403935
H  1.641853 -3.787757 -0.371716
H  4.061941 -3.11335 -0.059688
H  2.629001 4.278709 0.386901
H  4.33311 3.923803 -0.015462
H  3.203584 4.449357 -1.296401
H  -1.707711 2.02046 0.398833
H  -3.101635 -2.004659 -0.431226
H  -4.077491 2.85326 0.374848
H  -5.482445 -1.177271 -0.456301
H  -5.967106 1.255338 -0.05263
