program: Gaussian 09
title: 000299281
version: EM64L-G09RevD.01
frameworkgroup: C1[X(C16H12O4)]
method: RPBEPBE
basis: SDD
operation: Freq
keyword: #pfreq=noraman
keyword: PBEPBE/SDD
title: #p freq=noraman PBEPBE/SDD
converged: YES YES NO NO
title: Mulliken charges:
elementType: O O O O C C C C C C C C C C C C C C C C H H H H H H H H H H H H
charge: -0.258170 -0.284285 -0.249462 -0.244363 0.033136 0.031256 0.168088 0.161967 0.203849 0.174822 -0.416834 -0.416812 -0.381383 -0.350911 -0.210751 -0.210015 0.148190 0.155893 -0.511438 -0.503213 0.261043 0.261593 0.262932 0.267322 0.232125 0.230585 0.224123 0.245175 0.259500 0.234918 0.236775 0.244347
chargesum: 0.00000
title: Mulliken charges with hydrogens summed into heavy atoms:
elementType: O O O O C C C C C C C C C C C C C C C C
charge: -0.258170 -0.284285 -0.249462 -0.244363 0.033136 0.031256 0.168088 0.161967 0.203849 0.174822 -0.155791 -0.155220 -0.118451 -0.083589 0.021374 0.020569 0.148190 0.155893 0.217360 0.212827
polarizability: 2.74747179e+02 -1.25329476e+01 2.34104136e+02 -1.03830276e+01 9.80163083e+00 8.87234700e+01
1716.lowfreq: -6.3210 -5.1426 -0.0005 -0.0004 0.0004 2.8194 31.2273 40.0732 55.6309
frequency: 31.1629 40.0409 55.6270 90.0905 96.6818 103.5612 106.9643 118.4000 132.2010 152.8435 192.2381 208.9834 233.7594 263.6838 302.0032 312.2518 318.7157 346.2394 372.7100 386.9061 452.6462 468.6776 486.0971 535.8958 585.5180 594.4995 620.0438 670.2106 694.3417 716.5774 719.6617 731.4287 739.7873 774.6611 780.4789 805.6744 834.7493 852.4169 914.5746 919.7148 926.2699 951.9662 973.1110 982.8428 985.2468 1030.4741 1039.9921 1065.4881 1083.0072 1112.9210 1115.5599 1118.2280 1146.9253 1151.4037 1155.0302 1178.6522 1204.8980 1216.4328 1243.3346 1263.7061 1345.8957 1359.1334 1381.6772 1413.4526 1421.8763 1441.9443 1447.9690 1450.1463 1452.3071 1464.0870 1470.3525 1509.1744 1586.1775 1597.8476 1605.0935 1624.5418 1630.3850 1706.5397 3001.5071 3007.0811 3101.4718 3116.2406 3139.5000 3140.7991 3144.0381 3147.1975 3156.8431 3162.1751 3170.0871 3180.3199
redmass: 5.4386 5.2390 6.1011 1.0839 4.6120 1.2248 4.3065 5.0464 2.8181 5.3492 5.2191 4.6831 4.2289 4.8108 5.3489 4.5053 4.7721 6.2350 6.4434 6.8788 4.2445 5.8867 6.2655 4.3974 4.7429 6.3904 6.3323 6.8450 6.6111 6.3066 5.8014 5.8800 2.3634 1.7231 6.5864 1.8525 3.5451 6.3543 5.8987 1.4633 1.4588 6.9864 7.3383 1.3627 1.3502 2.9771 3.1124 3.0355 3.0247 1.2748 1.3860 2.3079 1.4551 1.6422 1.5153 1.7286 1.8101 1.9619 2.9417 3.2170 6.2603 2.2326 2.3648 1.2100 1.2046 2.3157 2.4227 1.0656 1.0521 1.0508 1.0521 7.3684 8.9985 8.5807 7.5681 10.4730 10.3839 9.5137 1.0298 1.0284 1.1042 1.1048 1.0866 1.0875 1.1053 1.1044 1.0927 1.0945 1.0988 1.0959
irintensity: 0.2438 0.2262 2.3273 0.3313 7.2446 0.1354 3.4922 1.9713 0.2429 0.3127 0.4603 8.9621 3.8710 10.9201 2.7319 4.6749 9.9683 1.5475 1.6657 8.7938 0.0203 0.1953 3.1483 1.8064 1.0774 0.7411 0.1645 12.2989 6.1605 2.3476 8.6261 6.3556 91.8508 3.7528 8.8067 71.9919 0.1345 13.2308 2.1421 2.3743 0.1642 10.8727 14.4912 1.4863 1.6783 11.1436 7.4640 196.5295 180.1653 0.1555 11.2241 0.6285 47.2778 18.9049 34.6648 2.2707 14.8133 16.8376 167.8813 220.0676 30.5694 0.6287 49.7188 33.9247 24.6013 12.7232 6.2603 3.6433 21.2508 16.8796 9.5099 0.2506 33.3576 23.1736 22.1133 251.3234 71.9656 18.0609 39.2947 36.0916 27.8923 15.1887 6.7570 6.0297 14.2780 18.1726 2.6743 12.1492 22.5010 9.9456
temp: 298.150 k
press: 1.00000 atm
elementType: 8 8 8 8 6 6 6 6 6 6 6 6 6 6 6 6 6 6 6 6 1 1 1 1 1 1 1 1 1 1 1 1
symmnumber: 1
zpe: 622561.0 jmol-1
zpe.correction: 0.237121 hartree
zpe.thermalcorrener: 0.255000 hartree
zpe.thermalcorrenthalpy: 0.255945 hartree
zpe.thermalcorrgfe: 0.190171 hartree
zpe.sumelectzpe: -916.351209 hartree
zpe.sumelectthermal: -916.333330 hartree
zpe.sumelectthermalent: -916.332386 hartree
zpe.sumelectthermalfe: -916.398159 hartree
dipole: -2.0560 2.4872 1.5222
dipole: 3.5679
quadrupole: -91.2791 -103.0900 -120.3208
quadrupole: 12.6093 1.8200 -6.4497
quadrupole: 13.6175 1.8067 -15.4242 12.6093 1.8200 -6.4497
hfenergy: -916.5883302 hartree
pointgroup: C01 [X(C16H12O4)]
dipole: -0.7915307 -0.980556 -0.6184266 debye
polarizability: 274.0078602|12.3024981|234.1692403|15.5974442|9.6894554|89.3976848 unknown
InChI: InChI=1S/C16H12O4/c1-19-15(17)11-7-3-5-9-10-6-4-8-12(16(18)20-2)14(10)13(9)11/h3-8H,1-2H3
charge 0 multiplicity 1
32 atoms
O  0.282689 2.407691 -0.929005
O  -3.628306 0.307265 -0.196629
O  1.761715 3.361955 0.605394
O  -1.825662 1.443588 0.745296
C  1.196661 -0.212271 -0.008382
C  -0.145989 -0.926613 -0.080476
C  1.873785 -1.489356 -0.030889
C  0.537824 -2.197652 -0.163166
C  1.906319 0.986764 0.071635
C  -1.542507 -0.849885 -0.062158
C  3.251639 -1.616024 0.0833
C  -0.128872 -3.407481 -0.299882
C  3.333624 0.86251 0.22308
C  -2.241011 -2.102946 -0.224469
C  3.9798 -0.385474 0.227898
C  -1.563323 -3.326886 -0.344576
C  1.325461 2.358609 -0.00991
C  -2.286453 0.411205 0.202613
C  -0.425402 3.706346 -1.027705
C  -4.465259 1.495657 0.081644
H  3.770262 -2.579151 0.07247
H  0.38366 -4.371735 -0.365414
H  3.915442 1.78403 0.328775
H  -3.333963 -2.080095 -0.238159
H  5.069353 -0.418175 0.335502
H  -2.146919 -4.246897 -0.457957
H  -0.993139 3.649658 -1.967428
H  0.297843 4.538525 -1.043554
H  -1.100067 3.805637 -0.162189
H  -5.474445 1.21275 -0.248877
H  -4.093361 2.365579 -0.486258
H  -4.449198 1.73487 1.158475
