program: Gaussian 09
title: 000299291
version: EM64L-G09RevD.01
frameworkgroup: C1[X(C17H15ClN2O3)]
method: RPBEPBE
basis: SDD
operation: Freq
keyword: #p
keyword: freq=noraman
keyword: PBEPBE/SDD
title: #p freq=noraman PBEPBE/SDD
converged: YES YES NO NO
title: Mulliken charges:
elementType: Cl O O O N N C C C C C C C C C C C C C C C C C H H H H H H H H H H H H H H H
charge: -0.053596 -0.246032 -0.291513 -0.225775 -0.522010 -0.695555 0.233520 0.251117 0.168699 0.064264 0.347298 -0.299951 0.090569 -0.330314 0.189362 -0.174548 -0.221311 -0.287848 -0.235896 -0.354593 -0.266819 -0.229157 -0.670022 0.318219 0.243544 0.271205 0.263180 0.253492 0.261864 0.199502 0.217477 0.227766 0.224801 0.208951 0.225471 0.233315 0.306971 0.304352
chargesum: 0.00000
title: Mulliken charges with hydrogens summed into heavy atoms:
elementType: Cl O O O N N C C C C C C C C C C C C C C C C C
charge: -0.053596 -0.246032 -0.291513 -0.225775 -0.203791 -0.084232 0.233520 0.251117 0.168699 0.064264 0.347298 -0.056406 0.090569 -0.059110 0.189362 -0.174548 0.041869 -0.034356 0.225471 -0.137116 -0.039053 -0.004356 -0.002285
polarizability: 3.33738146e+02 7.60596630e+00 2.79259502e+02 -1.27675295e+01 1.60321157e+01 1.36925511e+02
1716.lowfreq: -6.0111 -3.2476 -0.0014 0.0015 0.0020 3.2121 24.9995 26.5227 35.9546
frequency: 24.9055 26.3774 35.9370 39.9240 60.0085 66.1942 96.4503 124.8095 145.7960 154.1186 160.7399 200.2746 204.2198 235.5489 250.8857 277.6825 295.5640 306.7517 315.1581 329.6543 346.1063 357.7430 394.1103 426.6403 438.2107 453.6520 486.6551 503.3445 519.6746 539.4107 548.5768 560.8800 575.9101 594.8537 626.5086 641.5524 667.1971 681.9120 695.3225 702.3221 724.6799 731.6535 746.8964 792.7506 809.2703 817.5110 820.1962 836.9261 842.5035 856.6815 877.1994 910.6439 919.3982 949.3392 962.9196 999.3818 1023.2960 1035.8966 1052.3471 1083.0039 1101.3959 1113.7722 1129.1472 1130.3589 1161.5240 1173.4590 1200.9283 1220.0672 1241.2856 1247.5310 1268.0915 1291.8524 1305.2271 1333.6469 1360.1031 1390.7410 1396.1048 1397.0056 1413.1910 1452.9007 1458.5634 1459.9246 1478.2276 1491.2875 1494.0825 1522.7450 1552.5315 1596.0526 1601.2640 1604.6773 1614.7965 1639.4392 1644.3028 2988.1199 2995.3581 3078.4101 3093.0154 3108.7672 3120.8691 3140.4753 3157.3224 3158.7813 3166.7922 3176.8707 3185.5632 3452.0094 3501.8829 3638.9380
redmass: 2.4096 4.5377 4.1684 3.5859 4.3729 6.6262 4.6497 7.2289 4.8091 5.5885 8.4009 5.4361 4.8384 1.2263 2.5947 3.5685 2.1498 6.2097 9.4806 3.0947 5.9156 5.0134 6.2543 3.5222 3.3701 3.3863 4.6618 7.1698 6.2333 5.2201 3.4911 1.4619 5.6299 5.7958 5.9695 7.0389 7.3320 1.3245 7.3023 6.9804 4.6862 3.2381 1.2587 5.0394 1.1018 3.7589 1.4577 1.7113 2.8221 1.7718 5.1811 7.1088 1.4351 1.3368 1.3053 2.7525 2.1527 3.6302 1.8235 2.1113 2.4927 2.1109 1.4125 1.4552 1.7029 1.1252 5.8787 3.0093 2.2171 1.3264 1.5187 2.4656 1.7556 2.0483 1.5237 3.3962 4.4116 1.6592 4.4366 2.7629 1.0494 2.5632 1.0503 1.0887 2.9689 2.4226 6.9810 8.3677 5.1594 6.9692 3.7895 1.8964 3.1694 1.0613 1.0385 1.1004 1.0981 1.1022 1.0875 1.0891 1.0914 1.0950 1.0888 1.0984 1.0980 1.0741 1.0463 1.0997
irintensity: 0.9513 0.6946 1.5980 0.2758 2.3255 2.7565 2.2868 1.3610 2.1069 0.6847 0.0397 0.8292 3.6877 1.2835 3.3846 5.5814 38.7679 3.0082 1.3712 16.0865 5.8162 1.0408 6.0103 6.3944 8.4111 21.0644 3.1300 6.0431 26.4087 8.8969 10.1818 163.3406 17.4544 31.0634 1.1432 14.3610 1.5087 74.0713 1.1690 18.4657 3.1449 15.5448 110.0580 26.9175 4.1772 12.0122 54.7850 0.3378 4.8607 14.6990 11.8927 226.5779 7.8573 0.5979 0.7040 27.9275 8.1725 160.2255 8.8729 7.6131 65.8114 16.6930 15.5014 37.9867 69.7181 14.6970 27.6031 96.7890 3.5860 15.8957 64.2487 3.6471 15.8317 17.4223 27.3866 51.4674 23.4221 16.4569 14.5543 77.4408 12.3973 55.5977 18.2547 4.3996 126.7288 329.1581 105.3660 166.5864 22.5349 8.3447 1.8042 393.1460 366.5428 40.3260 27.4510 1.4836 33.4025 34.2275 13.9450 10.4437 2.1463 31.9592 0.1011 7.9851 1.2599 53.3791 18.3883 24.8799
temp: 298.150 k
press: 1.00000 atm
elementType: 17 8 8 8 7 7 6 6 6 6 6 6 6 6 6 6 6 6 6 6 6 6 6 1 1 1 1 1 1 1 1 1 1 1 1 1 1 1
symmnumber: 1
zpe: 749780.3 jmol-1
zpe.correction: 0.285576 hartree
zpe.thermalcorrener: 0.306764 hartree
zpe.thermalcorrenthalpy: 0.307708 hartree
zpe.thermalcorrgfe: 0.233660 hartree
zpe.sumelectzpe: -1450.408893 hartree
zpe.sumelectthermal: -1450.387705 hartree
zpe.sumelectthermalent: -1450.386761 hartree
zpe.sumelectthermalfe: -1450.460809 hartree
dipole: -1.6756 -3.6176 -3.3136
dipole: 5.1840
quadrupole: -129.1685 -151.9641 -133.3743
quadrupole: 8.1232 4.3954 2.9175
quadrupole: 9.0005 -13.7951 4.7946 8.1232 4.3954 2.9175
hfenergy: -1450.6944691 hartree
pointgroup: C01 [X(C17H15Cl1N2O3)]
dipole: 1.268799 -0.8170989 1.3719676 debye
polarizability: 328.5763371|14.1947836|275.8287716|-14.2896323|-38.9910206|145.5180504 unknown
InChI: InChI=1S/C17H15ClN2O3/c1-2-22-16-15(20-13-6-4-3-5-12(13)19)11-9-10(18)7-8-14(11)23-17(16)21/h3-9,20H,2,19H2,1H3
charge 0 multiplicity 1
38 atoms
Cl -3.277428 -4.465374 0.867986
O  -2.927084 1.433151 -0.168929
O  0.778689 2.047367 -0.058759
O  -1.760148 3.342108 -0.708328
N  0.686463 -0.714603 0.496391
N  2.742738 -1.710563 1.996927
C  -0.465593 0.016615 0.223747
C  -1.754276 -0.685138 0.275733
C  -2.952651 0.068955 0.119461
C  -0.457012 1.398516 -0.037251
C  1.999498 -0.589242 -0.047071
C  -1.877868 -2.089208 0.49045
C  -1.67223 2.145684 -0.352509
C  -4.22683 -0.528994 0.217787
C  3.055412 -1.163891 0.72808
C  -3.149321 -2.668216 0.589763
C  -4.335452 -1.909564 0.465542
C  2.271318 -0.047544 -1.323712
C  0.892017 3.421763 0.527938
C  4.361119 -1.220736 0.180969
C  3.580892 -0.091017 -1.847182
C  4.622673 -0.691411 -1.101418
C  2.381869 3.747825 0.540521
H  0.55964 -1.583837 1.027728
H  -0.996242 -2.734627 0.544087
H  -5.113808 0.097626 0.091639
H  -5.314346 -2.389452 0.545991
H  1.458531 0.393138 -1.906801
H  0.308666 4.123119 -0.090633
H  0.463867 3.400346 1.549806
H  5.17257 -1.663194 0.771887
H  3.782086 0.329681 -2.837616
H  5.637674 -0.737709 -1.510499
H  2.537332 4.760427 0.956259
H  2.944688 3.022362 1.152531
H  2.7911 3.725519 -0.483887
H  2.106616 -1.184144 2.598664
H  3.481828 -2.215937 2.484408
