program: Gaussian 09
title: 000299245
version: EM64L-G09RevD.01
frameworkgroup: C1[X(C7H4ClNO3S)]
method: RPBEPBE
basis: SDD
operation: Freq
keyword: #p
keyword: freq=noraman
keyword: PBEPBE/SDD
title: #p freq=noraman PBEPBE/SDD
converged: NO YES NO NO
title: Mulliken charges:
elementType: Cl S O O O N C C C C C C C H H H H
charge: 0.015848 0.217898 -0.166359 -0.197526 -0.197529 0.025629 0.392393 0.380299 -0.322435 -0.322419 -0.296749 -0.296874 -0.367315 0.295954 0.295955 0.271611 0.271619
chargesum: 0.00000
title: Mulliken charges with hydrogens summed into heavy atoms:
elementType: Cl S O O O N C C C C C C C
charge: 0.015848 0.217898 -0.166359 -0.197526 -0.197529 0.025629 0.392393 0.380299 -0.026481 -0.026464 -0.025138 -0.025255 -0.367315
polarizability: 2.07483562e+02 -1.58010548e-01 1.00118390e+02 2.01216496e+01 1.98193961e-01 7.18016920e+01
1716.lowfreq: -22.4279 -9.4980 -0.0008 0.0017 0.0025 1.0074 7.8064 33.6129 47.6469
frequency: -22.3050 33.4294 47.6341 68.1373 136.1735 212.8250 230.0034 280.8624 329.3001 370.7495 412.3429 420.8392 456.8847 481.8700 507.5374 521.5169 620.6585 627.3079 661.3811 722.7658 749.6033 802.2892 837.5415 861.3893 921.4728 984.5122 991.9370 1000.6657 1088.8413 1102.1049 1141.3353 1173.0118 1209.1177 1224.4159 1283.6824 1365.3321 1400.8737 1417.4230 1464.3957 1596.0539 1606.3142 3173.9106 3173.9579 3191.2839 3194.0237
redmass: 7.5578 14.2836 15.1278 8.0945 10.7687 9.7672 19.9359 9.1542 15.3740 6.8718 2.9285 7.3687 10.2363 12.7378 7.0527 4.6525 7.2054 8.6942 4.5817 5.5319 7.8109 7.4020 1.2396 1.8512 6.4591 1.3551 1.3632 3.0717 3.1939 1.2590 2.6197 1.5623 9.1943 10.6314 1.2582 7.9747 8.2690 4.5996 2.3517 6.4246 8.4547 1.0901 1.0902 1.0966 1.0978
irintensity: 0.4317 0.2376 1.9082 0.0089 3.8359 5.5732 0.7775 1.8934 4.1960 2.9790 0.0151 1.4296 16.1748 0.0274 0.1871 57.3845 0.2892 22.6229 20.5772 0.6331 29.1166 51.2515 0.0528 20.7562 246.4782 0.2386 0.0206 28.1603 1.4664 19.7844 80.1504 19.4856 1194.9416 60.1217 1.9291 95.0945 5.0751 43.3880 44.0105 62.7993 6.4220 0.0970 0.4260 1.6648 5.4605
temp: 298.150 k
press: 1.00000 atm
elementType: 17 16 8 8 8 7 6 6 6 6 6 6 6 1 1 1 1
symmnumber: 1
zpe: 263762.9 jmol-1
zpe.correction: 0.100462 hartree
zpe.thermalcorrener: 0.111367 hartree
zpe.thermalcorrenthalpy: 0.112311 hartree
zpe.thermalcorrgfe: 0.061314 hartree
zpe.sumelectzpe: -1406.649199 hartree
zpe.sumelectthermal: -1406.638294 hartree
zpe.sumelectthermalent: -1406.637350 hartree
zpe.sumelectthermalfe: -1406.688347 hartree
dipole: -1.4710 0.0073 -0.8174
dipole: 1.6829
quadrupole: -120.0829 -80.5926 -90.8062
quadrupole: 0.0226 -2.2693 0.0817
quadrupole: -22.9224 16.5680 6.3544 0.0226 -2.2693 0.0817
hfenergy: -1406.7496611 hartree
pointgroup: C01 [X(C7H4Cl1N1O3S1)]
dipole: 0.5873438 -0.000511 -0.3055988 debye
dipolederiv: -0.3936649 0.0003492 0.3566907 0.0001776 -0.0136848 -0.0010785 0.1898731 -0.0010255 -0.9477902 -1.011621 0.0001449 0.2194774 0.0000074 -0.0209808 -0.0002309 0.1998245 -0.000213 -0.2419691 -2.2472691 -0.0005362 -0.2951431 -0.0016123 -0.1700128 -0.0006847 -0.6656129 -0.0007128 -0.6839648 -0.7342439 0.1913401 0.0515715 0.1897302 -0.6575402 -0.0146165 0.075741 -0.0278077 -0.2279488 -0.7344152 -0.1913185 0.0517357 -0.1896363 -0.6573808 0.0149475 0.0758751 0.0281268 -0.2279868 1.8296058 -0.000147 -0.1717489 -0.0002789 1.0872241 -0.0003241 -0.2408671 -0.0003097 0.2185514 -0.6545835 0.0001049 0.0529832 0.0001594 0.0322777 -0.0000307 0.1083329 -0.000012 0.0481706 1.5131663 0.0001563 0.1084397 -0.000192 0.3517686 -0.0002227 -0.1716618 -0.0001494 0.0997679 0.1724425 -0.1189339 -0.0336846 0.2039664 -0.0250889 -0.0099723 -0.0524347 0.0199562 -0.0835802 0.1723346 0.118848 -0.0338179 -0.2040098 -0.0251486 0.0099842 -0.0522897 -0.0199578 -0.0835915 -0.4242404 0.1535803 -0.0449639 0.1939185 -0.0263453 -0.0254465 0.0402549 -0.0119173 -0.0971421 -0.4243576 -0.1536095 -0.0448147 -0.1937027 -0.0261186 0.0254298 0.0400887 0.0119064 -0.0971965 2.6039047 0.0000307 -0.2751062 0.0014635 -0.0808338 0.0020877 0.3879448 0.0019937 1.6701637 0.0992799 0.0515573 0.00365 0.0137457 0.0787516 -0.0022015 0.0093586 -0.0078639 0.1705532 0.0992691 -0.0515803 0.0036951 -0.0137398 0.0788014 0.002273 0.0093963 0.0079218 0.170538 0.0671439 -0.0531954 0.0255454 -0.0724477 0.0371741 0.0024804 0.023127 0.0008841 0.1566913 0.0672488 0.0532092 0.025491 0.0724508 0.0371373 -0.0023941 0.0230493 -0.0008197 0.1567339 unknown
polarizability: 208.4858192|-0.0068415|100.1197737|-16.3680082|0.0087319|70.7980515 unknown
InChI: InChI=1S/C7H4ClNO3S/c8-7(13)12-6-3-1-5(2-4-6)9(10)11/h1-4H
charge 0 multiplicity 1
17 atoms
Cl 2.756722 0.002226 1.881242
S  4.9774 -0.000013 -0.283178
O  2.356361 -0.001239 -0.809326
O  -3.839292 1.141985 0.235813
O  -3.839784 -1.140751 0.23671
N  -3.243355 0.000454 0.147159
C  -1.773598 0.000048 -0.074195
C  0.957266 -0.000714 -0.48167
C  -1.101923 1.238172 -0.178968
C  -1.102475 -1.238451 -0.178016
C  0.290096 1.23672 -0.390936
C  0.28955 -1.237776 -0.389979
C  3.378379 0.000172 0.11465
H  -1.669582 2.168258 -0.097186
H  -1.670541 -2.168224 -0.095513
H  0.850706 2.170459 -0.487092
H  0.849772 -2.171822 -0.485413
