program: Gaussian 09
title: 000299298
version: EM64L-G09RevD.01
frameworkgroup: C1[X(C24H21NO4S)]
method: RPBEPBE
basis: SDD
operation: Freq
keyword: #p
keyword: freq=noraman
keyword: PBEPBE/SDD
title: #p freq=noraman PBEPBE/SDD
converged: YES YES NO NO
title: Mulliken charges:
elementType: S O O O O N C C C C C C C C C C C C C C C C C C C C C C C C H H H H H H H H H H H H H H H H H H H H H
charge: 0.401402 -0.196883 -0.259391 -0.227197 -0.229614 -0.170407 -0.300704 -0.430544 -0.478151 0.268172 -0.390364 0.100637 0.414639 0.216220 0.127837 -0.790985 0.314451 0.230868 -0.347360 -0.412686 -0.260518 -0.369600 -0.326873 -0.244337 -0.233866 -0.242907 -0.221550 -0.232595 -0.658425 -0.226799 0.291297 0.270142 0.233080 0.267015 0.275120 0.286089 0.258773 0.244680 0.231657 0.221353 0.264028 0.239526 0.227195 0.224621 0.227456 0.236698 0.238050 0.209418 0.238065 0.256571 0.236693
chargesum: 0.00000
title: Mulliken charges with hydrogens summed into heavy atoms:
elementType: S O O O O N C C C C C C C C C C C C C C C C C C C C C C C C
charge: 0.401402 -0.196883 -0.259391 -0.227197 -0.229614 -0.170407 -0.009407 0.072678 0.063984 0.268172 -0.390364 0.100637 0.414639 0.216220 0.127837 -0.504895 0.314451 0.230868 -0.088588 -0.168007 0.192493 -0.105572 -0.087346 -0.017142 -0.009244 -0.015451 0.015149 0.005455 0.045628 0.009894
polarizability: 4.63560937e+02 7.12357262e+00 2.76760613e+02 3.97718739e+00 2.10135031e+01 1.90034479e+02
1716.lowfreq: -8.6081 -3.9955 -2.6453 0.0005 0.0010 0.0011 16.7949 21.3626 35.3524
frequency: 15.9000 21.2773 35.2953 36.2014 42.5530 49.4798 54.2564 60.0857 73.8730 86.1372 96.1119 130.0212 133.2615 157.6116 171.2578 177.2124 196.0495 211.0019 222.0490 247.8003 253.1920 286.1930 289.7797 307.3732 318.9700 322.4386 361.9109 371.1650 391.7540 406.7616 408.3416 416.9911 448.5596 457.6232 471.5979 510.8397 524.1791 550.4592 568.5092 601.7356 612.2220 614.1826 619.9534 637.2492 648.1572 691.5297 698.0547 702.1253 709.0292 720.2172 738.1079 742.7272 761.0895 770.9623 782.3370 787.2534 799.3403 817.6517 838.6889 848.4308 851.9624 857.6738 895.5660 922.3524 933.8297 941.3886 958.9872 972.1137 981.9084 988.8662 990.0834 992.7674 998.3285 1003.9944 1013.5187 1022.8148 1028.7003 1037.5992 1064.7756 1082.1967 1083.8945 1096.8604 1104.5686 1127.7535 1139.0018 1158.6929 1171.6473 1172.0855 1175.9510 1189.0252 1193.5648 1194.2305 1200.6438 1243.6426 1260.3420 1275.1884 1276.3551 1301.1399 1316.5365 1317.1979 1337.4728 1349.6352 1356.0077 1369.9497 1372.4071 1377.3154 1379.5169 1395.7851 1431.4413 1432.6872 1450.7854 1459.3411 1462.6867 1468.3481 1472.6637 1478.3906 1481.7018 1483.9867 1525.7617 1551.4959 1575.1077 1583.9689 1588.0343 1609.1603 1611.4889 1640.8167 2995.1732 3009.8401 3017.9852 3024.8976 3029.8541 3077.8080 3091.6791 3096.8698 3098.5046 3121.9081 3122.5929 3131.2850 3132.3254 3141.0601 3144.2874 3152.0717 3159.8468 3160.8436 3172.1448 3186.0886 3223.0450
redmass: 4.7162 6.1290 3.9825 4.7533 5.1832 5.1259 4.8063 6.0765 5.0532 3.8631 5.1140 5.3656 4.7145 5.7059 6.4318 5.7128 1.5812 4.8982 3.6935 3.3116 4.4026 4.9870 6.4156 4.2842 3.9370 6.0555 5.8795 4.3513 4.8746 2.9871 2.9061 3.9728 8.8120 3.6313 3.8760 5.2830 4.6965 8.2857 4.3976 5.4978 5.6423 6.4327 5.2717 6.1103 4.9742 4.7012 4.8619 1.8466 1.6262 4.7800 3.3956 1.5353 2.3170 3.3028 2.6307 2.2656 3.2600 1.6152 3.2821 1.2532 5.4488 1.2662 3.4068 1.4549 1.6348 2.5433 3.8073 1.3826 1.4115 4.2192 5.5016 1.4501 3.2024 1.3440 3.1072 3.4540 2.4241 1.9694 2.2668 1.6105 1.6053 2.2170 3.5811 2.1236 2.7473 1.6926 3.3745 1.0856 1.0573 1.1136 1.2701 1.3886 1.6229 1.8999 2.5518 2.3689 1.1322 1.4012 1.3403 1.3869 2.3101 1.4364 1.4226 4.7315 1.2802 6.3253 8.0180 1.2256 2.3253 2.2230 2.6134 1.0810 1.0528 1.2522 1.3461 2.1900 1.0972 2.1308 7.0122 11.3877 9.0421 6.1949 6.2534 6.0353 6.1662 9.8587 1.0368 1.0664 1.0611 1.0823 1.0597 1.1002 1.0972 1.1038 1.0997 1.0847 1.1052 1.0887 1.0851 1.0880 1.0942 1.0924 1.0995 1.0966 1.1016 1.0956 1.0952
irintensity: 0.4323 0.5098 0.3714 0.3090 3.0176 0.4365 0.6926 2.7285 2.3342 1.4454 0.3003 4.3959 0.1500 0.2195 4.1854 0.8729 3.4261 2.5969 1.5952 0.3407 0.9915 4.3465 2.6676 10.0901 7.9340 0.4333 6.3537 12.8278 5.7433 1.8651 0.0311 0.8365 2.4538 1.6562 8.5391 2.3854 16.2317 6.0899 1.7690 4.8636 1.1859 0.0063 2.7593 0.9060 11.7673 11.3105 17.3238 41.6734 88.9352 13.0455 7.6528 67.8825 2.5251 6.2453 4.9876 38.9070 2.3023 8.9778 22.8530 1.4104 12.2412 5.1051 19.8859 3.6022 9.7860 27.4626 41.8641 1.2965 3.9792 0.4942 1.9548 0.3382 64.7175 0.0987 44.1444 37.6276 5.5725 15.8925 38.4590 7.4872 6.1799 52.2852 18.5280 40.7257 224.4432 22.7750 12.4722 0.2077 0.0344 13.7184 14.5341 55.9530 21.2194 180.8544 36.2308 132.0719 2.1968 93.6557 4.5667 1.1021 225.2206 14.7605 1.5251 32.0720 46.0140 54.1607 1.4640 23.3556 12.3947 12.6728 81.7264 13.8652 11.2209 17.5639 30.9952 43.6825 31.6085 38.2978 13.1469 185.9192 146.4520 18.6542 5.5942 4.9303 1.0403 173.5315 16.6675 13.6702 13.0844 3.3214 36.1604 13.2625 40.0726 0.5504 13.1235 1.8539 25.7928 5.5379 0.6798 2.3595 33.0107 19.4677 40.8863 21.3195 19.4658 4.4319 1.3123
temp: 298.150 k
press: 1.00000 atm
elementType: 16 8 8 8 8 7 6 6 6 6 6 6 6 6 6 6 6 6 6 6 6 6 6 6 6 6 6 6 6 6 1 1 1 1 1 1 1 1 1 1 1 1 1 1 1 1 1 1 1 1 1
symmnumber: 1
zpe: 1029380.2 jmol-1
zpe.correction: 0.392070 hartree
zpe.thermalcorrener: 0.418979 hartree
zpe.thermalcorrenthalpy: 0.419923 hartree
zpe.thermalcorrgfe: 0.331830 hartree
zpe.sumelectzpe: -1678.737765 hartree
zpe.sumelectthermal: -1678.710856 hartree
zpe.sumelectthermalent: -1678.709912 hartree
zpe.sumelectthermalfe: -1678.798005 hartree
dipole: 2.2150 1.3969 -0.1341
dipole: 2.6221
quadrupole: -149.5223 -185.1924 -180.1992
quadrupole: 7.2435 13.5824 -10.8726
quadrupole: 22.1157 -13.5545 -8.5612 7.2435 13.5824 -10.8726
hfenergy: -1679.1298354 hartree
pointgroup: C01 [X(C24H21N1O4S1)]
dipole: 0.9806315 -0.2762547 -0.1620909 debye
polarizability: 443.1593521|52.2413881|280.4861278|-45.6178702|24.5184386|206.7105482 unknown
InChI: InChI=1S/C24H21NO4S/c1-2-29-24(28)18-13-14-25(22(27)17-11-7-4-8-12-17)23-20(21(18)26)19(15-30-23)16-9-5-3-6-10-16/h3-12,15,18H,2,13-14H2,1H3
charge 0 multiplicity 1
51 atoms
S  -0.116698 2.88816 1.286524
O  -1.664505 -1.359779 -1.062306
O  -0.278857 -3.475254 0.865937
O  0.706408 -3.822399 -1.223403
O  2.538612 2.939399 1.085028
N  1.617768 1.188903 -0.164371
C  0.62309 -1.554488 -0.226207
C  1.657301 -1.118219 -1.292638
C  1.699889 0.4114 -1.450823
C  -0.807761 0.566405 0.133103
C  0.317548 1.389414 0.36177
C  -0.715012 -0.799132 -0.443402
C  -2.050852 1.134785 0.673104
C  0.375131 -3.061417 -0.287247
C  2.71623 1.969924 0.28601
C  -1.823451 2.336156 1.321884
C  -3.414239 0.525956 0.684927
C  4.094701 1.634266 -0.207538
C  -4.086206 0.131469 -0.502842
C  -4.103543 0.41287 1.924374
C  -0.762233 -4.89387 0.892257
C  4.919462 2.705727 -0.640152
C  4.638399 0.326321 -0.124721
C  -5.408672 -0.358032 -0.449304
C  -5.424994 -0.082131 1.977836
C  -6.084284 -0.4688 0.788634
C  6.252695 2.46345 -1.030426
C  5.979867 0.089764 -0.496965
C  -2.124845 -4.997481 0.202593
C  6.785708 1.153972 -0.962933
H  0.99534 -1.301655 0.783729
H  1.384577 -1.570548 -2.263302
H  2.648695 -1.521998 -1.02314
H  2.622094 0.715564 -1.969208
H  0.841416 0.745845 -2.062599
H  -2.55807 2.953505 1.837154
H  -3.570255 0.205653 -1.462571
H  -3.587863 0.697579 2.84891
H  -0.005792 -5.529884 0.399288
H  -0.817201 -5.127383 1.967381
H  4.507036 3.719875 -0.655824
H  4.032303 -0.49435 0.272403
H  -5.911093 -0.65535 -1.3765
H  -5.934898 -0.169169 2.94396
H  -7.109888 -0.853332 0.825565
H  6.878177 3.293465 -1.375763
H  6.396123 -0.919965 -0.414859
H  -2.503972 -6.033456 0.282525
H  -2.856062 -4.318403 0.672518
H  -2.04324 -4.736111 -0.865231
H  7.824418 0.96788 -1.257037
