program: Gaussian 09
title: 000299249
version: EM64L-G09RevD.01
frameworkgroup: C1[X(C19H16O2)]
method: RPBEPBE
basis: SDD
operation: Freq
keyword: #pfreq=noraman
keyword: PBEPBE/SDD
title: #p freq=noraman PBEPBE/SDD
converged: YES YES NO NO
title: Mulliken charges:
elementType: O O C C C C C C C C C C C C C C C C C C C H H H H H H H H H H H H H H H H
charge: -0.412530 -0.241744 -0.384708 0.451404 -0.021236 0.454284 0.239406 -0.748019 -0.411501 0.415407 -0.491291 -0.396262 -0.416237 -0.346639 -0.432457 0.015197 -0.255156 -0.248570 -0.228898 -0.243990 -0.243603 0.259868 0.231266 0.214894 0.234717 0.249774 0.239946 0.270950 0.236747 0.255519 0.243556 0.228235 0.230862 0.224195 0.221495 0.225907 0.379212
chargesum: 0.00000
title: Mulliken charges with hydrogens summed into heavy atoms:
elementType: O O C C C C C C C C C C C C C C C C C C C
charge: -0.033318 -0.241744 -0.124840 0.451404 -0.021236 0.454284 0.239406 -0.067142 -0.161727 0.415407 -0.251345 -0.125311 -0.179489 -0.091121 -0.188902 0.015197 -0.026921 -0.017709 -0.004703 -0.022495 -0.017696
polarizability: 2.97296317e+02 -7.15491188e+00 1.96067724e+02 1.50885836e+01 -1.16658335e+01 1.52625361e+02
1716.lowfreq: -8.0259 -0.5080 -0.0006 -0.0005 0.0008 4.8398 28.9640 34.2992 41.2927
frequency: 28.9463 34.2881 41.2612 59.2290 75.3581 111.0648 164.3519 182.5040 195.0485 202.7781 225.1073 247.2448 267.6107 296.0572 345.1140 364.3686 392.8102 403.6975 418.9620 450.6791 474.1692 513.3141 522.5032 547.4509 558.6468 599.7663 614.3236 616.3299 630.0012 681.6919 683.8142 705.9760 712.2493 734.5070 760.5716 765.8543 785.8642 818.8297 833.5432 848.5063 859.4406 888.9130 900.4851 927.5194 958.7115 974.6134 982.3589 983.4660 987.9414 993.1759 995.2830 1001.0288 1024.9602 1035.2206 1046.0620 1053.2563 1070.2145 1107.1109 1151.3306 1172.1345 1176.6728 1183.8036 1193.0424 1199.6310 1220.0677 1239.0494 1259.6780 1278.4761 1294.8286 1327.4807 1337.3660 1341.1449 1382.2034 1391.4457 1405.2778 1414.5734 1427.2846 1437.9018 1459.8608 1473.0123 1482.6877 1486.7973 1515.2822 1569.7698 1591.1975 1602.3908 1612.6620 1619.6996 1629.8043 2983.0115 3049.1158 3081.1713 3084.1910 3118.9783 3122.7601 3124.6013 3126.0235 3137.3255 3138.1016 3146.8175 3150.5369 3159.1786 3161.3693 3183.7600 3492.1642
redmass: 4.4056 5.0490 4.5646 9.6372 4.8902 4.3957 4.4029 5.0522 4.3117 3.7670 3.2445 4.9036 1.1144 4.2019 6.5412 4.7858 4.0300 2.8466 3.6809 3.7031 3.7460 3.3147 6.6773 3.3110 3.5687 4.0678 1.7702 4.6474 3.6361 4.0981 3.0774 2.6665 2.1112 4.9384 1.5068 2.5764 2.1454 2.1169 4.6655 1.8358 1.2457 1.9646 4.1709 1.4070 1.4436 4.2086 1.4755 1.4100 3.2276 1.6777 1.7620 1.3676 2.2028 2.2039 1.6942 2.2920 2.3990 1.8111 1.4774 1.0552 1.2043 1.2722 1.1200 2.5178 2.5806 1.9145 1.9158 1.5220 1.4908 2.0452 1.3952 2.3992 5.8379 1.2456 3.4332 3.9917 2.9705 2.1817 2.2240 1.0579 1.7398 1.2339 3.4586 7.5290 5.9896 6.1691 5.9852 8.1195 6.5320 1.0354 1.0848 1.0976 1.0998 1.0843 1.0873 1.0865 1.0877 1.0904 1.0922 1.0958 1.0964 1.0975 1.1015 1.0950 1.0637
irintensity: 0.1341 0.1723 0.3225 1.3345 0.0747 0.8523 1.9058 0.3751 1.9878 3.2256 0.1147 0.2459 0.1982 0.6359 3.8093 2.4254 2.9183 0.0641 1.8820 5.7413 9.7554 7.6610 4.8861 7.1969 15.2037 21.6636 65.7857 15.1057 28.9980 11.3742 22.7043 22.4672 48.4110 8.1958 44.0576 21.9564 26.4480 2.9741 2.4931 40.8428 0.0778 9.4964 11.5433 3.7849 6.9819 108.8346 8.3723 0.2124 7.8392 6.6691 5.3656 0.7724 21.0736 8.4909 28.1782 24.6258 150.1903 6.5828 25.0331 0.0404 3.9604 16.6808 3.6115 1.6186 0.1452 7.2708 18.9911 6.4836 8.1635 37.5457 5.3800 2.1313 1.7748 15.1376 7.7705 0.5029 5.4557 9.9537 12.3300 8.5508 35.2314 2.2522 22.5559 12.0201 2.2672 4.8351 29.3372 257.3982 10.1515 25.5483 3.0740 35.3195 32.1350 1.3374 0.8356 5.0449 3.5618 15.5763 12.5882 36.3390 16.8733 33.8933 30.3932 12.8201 34.7913
temp: 298.150 k
press: 1.00000 atm
elementType: 8 8 6 6 6 6 6 6 6 6 6 6 6 6 6 6 6 6 6 6 6 1 1 1 1 1 1 1 1 1 1 1 1 1 1 1 1
symmnumber: 1
zpe: 770633.2 jmol-1
zpe.correction: 0.293519 hartree
zpe.thermalcorrener: 0.311070 hartree
zpe.thermalcorrenthalpy: 0.312014 hartree
zpe.thermalcorrgfe: 0.246922 hartree
zpe.sumelectzpe: -882.634420 hartree
zpe.sumelectthermal: -882.616868 hartree
zpe.sumelectthermalent: -882.615924 hartree
zpe.sumelectthermalfe: -882.681016 hartree
dipole: -1.2120 -0.8210 0.8825
dipole: 1.7094
quadrupole: -112.1659 -110.2572 -121.6458
quadrupole: -5.5196 5.5054 -0.9404
quadrupole: 2.5237 4.4324 -6.9561 -5.5196 5.5054 -0.9404
hfenergy: -882.9279383 hartree
pointgroup: C01 [X(C19H16O2)]
dipole: -0.4944084 -0.316771 0.3278722 debye
polarizability: 296.1369771|-12.2711178|197.9704307|15.4664801|-10.3664693|151.8819935 unknown
InChI: InChI=1S/C19H16O2/c1-13(14-7-3-2-4-8-14)16-12-11-15-9-5-6-10-17(15)18(16)19(20)21/h2-13,20H,1H3
charge 0 multiplicity 1
37 atoms
O  -1.791533 3.024325 0.63149
O  0.13741 2.807218 -0.617859
C  1.507506 0.649942 1.102288
C  0.160545 0.028602 0.686545
C  -0.952783 0.778349 0.242893
C  2.651459 0.06845 0.251532
C  -2.219286 0.130279 -0.058714
C  1.707989 0.492554 2.631934
C  0.022026 -1.391688 0.830949
C  -2.318168 -1.307157 0.098926
C  -1.173121 -2.040278 0.548021
C  2.74056 0.451828 -1.114185
C  3.614994 -0.834459 0.765516
C  -3.375783 0.829411 -0.545176
C  -3.545688 -1.977955 -0.21188
C  -0.788673 2.249074 0.023264
C  -4.558751 0.148639 -0.845618
C  -4.652651 -1.26682 -0.675674
C  3.761938 -0.058544 -1.942951
C  4.639856 -1.34791 -0.064176
C  4.716311 -0.96472 -1.421376
H  1.47802 1.730944 0.887239
H  2.670115 0.937795 2.943555
H  1.698822 -0.565497 2.950305
H  0.896214 1.006889 3.176118
H  0.893926 -1.968276 1.157809
H  -1.252255 -3.128543 0.657104
H  2.005068 1.159784 -1.51497
H  3.581719 -1.134071 1.818803
H  -3.337102 1.914051 -0.666087
H  -3.596009 -3.065706 -0.083636
H  -5.42649 0.707416 -1.213088
H  -5.587641 -1.785492 -0.91307
H  3.817094 0.25147 -2.992817
H  5.379058 -2.042911 0.351098
H  5.510919 -1.361635 -2.063349
H  -1.605515 3.983842 0.433238
