program: Gaussian 09
title: 000299235
version: EM64L-G09RevD.01
frameworkgroup: C1[X(C8H11N3OS2)]
method: RPBEPBE
basis: SDD
operation: Freq
keyword: #p
keyword: freq=noraman
keyword: PBEPBE/SDD
title: #p freq=noraman PBEPBE/SDD
converged: YES YES NO NO
title: Mulliken charges:
elementType: S S O N N N C C C C C C C C H H H H H H H H H H H
charge: 0.286445 0.031625 -0.282661 -0.020909 0.059744 0.036417 -0.631241 -0.603349 -0.185120 0.254057 -0.306296 -0.383808 -0.259131 -0.828326 0.237302 0.279878 0.239156 0.269628 0.260432 0.220700 0.260666 0.255357 0.271481 0.295986 0.241966
chargesum: 0.00000
title: Mulliken charges with hydrogens summed into heavy atoms:
elementType: S S O N N N C C C C C C C C
charge: 0.286445 0.031625 -0.282661 -0.020909 0.059744 0.036417 0.125094 0.147411 -0.185120 0.254057 -0.045630 -0.383808 -0.003773 -0.018893
polarizability: 1.81187979e+02 -1.87350022e-01 1.60061216e+02 1.23315331e+01 3.94665078e-01 1.05553294e+02
1716.lowfreq: -13.7177 -5.0972 -3.0143 -0.0017 -0.0016 0.0015 21.5585 26.9225 27.3536
frequency: 18.9588 26.8835 27.3217 61.9779 84.0480 99.0781 118.0334 126.6600 161.4977 174.5909 207.7890 231.7386 253.8203 318.4474 326.2935 382.6659 423.7106 432.2435 449.3780 505.8707 544.8104 601.0581 625.0867 659.7176 676.3057 720.7114 767.2467 835.3600 867.5101 928.0255 945.2986 963.0277 982.2703 997.6904 1028.6339 1053.5602 1063.3706 1090.1780 1137.5119 1160.0227 1186.4809 1228.9353 1255.6748 1260.9909 1300.9019 1352.0955 1385.3612 1401.5777 1426.1521 1436.4892 1450.1438 1453.5454 1462.3867 1476.0713 1484.3384 1506.8591 1524.8369 1542.6556 2981.6204 2990.1895 3022.4660 3059.1035 3077.5797 3110.4475 3147.6088 3151.8346 3154.0398 3154.6727 3204.3913
redmass: 1.2135 4.0548 4.4772 5.6968 3.9492 2.6047 1.2147 1.1735 4.6386 3.1995 7.0748 4.7474 3.2865 5.8646 3.8835 9.3739 3.8872 4.0036 5.3960 4.8850 9.6396 8.0814 7.6369 7.3627 8.0187 8.5910 5.1653 1.4573 5.9774 7.3265 4.6216 1.4194 1.1818 1.3020 4.8329 1.6749 1.7062 1.2287 1.3785 1.8909 2.8983 4.8848 6.7451 6.3941 3.0697 1.1984 1.8579 1.7369 1.1303 1.0518 1.0435 1.0548 1.1436 1.0494 1.0475 4.6285 2.3626 5.4926 1.0367 1.0350 1.0282 1.1019 1.1001 1.1023 1.1043 1.0921 1.0961 1.1057 1.0968
irintensity: 0.0917 3.3447 0.2114 0.3983 5.4445 0.4612 0.2384 0.3124 2.5781 3.4942 0.4866 3.5522 2.3742 0.9321 7.5516 6.9257 8.3694 1.3613 6.8637 3.5174 0.3004 17.7230 0.2844 0.4965 2.8644 19.9069 0.9414 35.5370 47.1125 7.1124 59.5778 0.2066 9.3382 2.1111 512.2068 4.1310 27.0298 1.4036 2.9944 139.6486 115.6482 196.5729 31.1149 60.1056 77.6850 8.7595 207.5181 83.9082 10.0118 15.3948 19.7460 24.9873 19.8985 9.2808 12.1735 407.1316 178.6600 173.6346 39.5862 60.2822 19.2753 26.1417 16.4984 15.5352 10.0201 19.5610 3.9452 8.9366 1.1020
temp: 298.150 k
press: 1.00000 atm
elementType: 16 16 8 7 7 7 6 6 6 6 6 6 6 6 1 1 1 1 1 1 1 1 1 1 1
symmnumber: 1
zpe: 486089.7 jmol-1
zpe.correction: 0.185142 hartree
zpe.thermalcorrener: 0.200867 hartree
zpe.thermalcorrenthalpy: 0.201812 hartree
zpe.thermalcorrgfe: 0.138568 hartree
zpe.sumelectzpe: -1345.979021 hartree
zpe.sumelectthermal: -1345.963296 hartree
zpe.sumelectthermalent: -1345.962351 hartree
zpe.sumelectthermalfe: -1346.025595 hartree
dipole: -4.8918 0.6799 -3.3771
dipole: 5.9831
quadrupole: -94.1666 -84.4262 -100.0233
quadrupole: 1.2835 8.5502 2.6985
quadrupole: -1.2945 8.4458 -7.1513 1.2835 8.5502 2.6985
hfenergy: -1346.164163 hartree
pointgroup: C01 [X(C8H11N3O1S2)]
dipole: -1.9794015 -0.0385906 1.2733465 debye
dipolederiv: -0.0931889 -0.3711002 -0.0021028 -0.2921354 -0.5653336 -0.0120088 -0.0129891 0.0108361 -0.0579207 -0.40279 0.0243032 0.1117741 0.0828513 -0.2677201 0.1627458 0.0900946 0.1083873 -0.7775089 -2.0540827 0.4495639 -0.3490269 0.9510064 -0.6365168 0.3604992 -0.1768427 0.2052499 -0.5560695 -1.0402427 0.187771 0.4611135 0.2404801 -0.3009743 0.0085365 0.4250183 0.0260953 -0.7964507 -1.2508196 -0.5405459 -0.0583289 -0.4302494 -0.6213353 -0.0717679 0.090108 -0.0140484 -0.0773088 -0.4859356 0.1346831 -0.0233171 -0.4566671 -1.1508789 -0.0257875 0.0291349 0.0230215 -0.1771919 0.1035861 0.1109709 -0.0490933 0.1934909 0.1873195 -0.0719169 -0.21834 -0.0003113 0.4389809 0.3676713 -0.0801084 -0.0458657 -0.1343249 0.2613807 0.0159161 0.1342627 -0.0382628 0.0823744 1.5970124 -0.4627875 -0.4547979 -1.1157843 0.4902237 -0.4314961 -0.1626747 -0.3246547 1.4454748 2.191163 -0.1717433 0.3133065 -0.1638972 0.7038501 0.0631102 -0.1921077 0.089699 0.1151916 -0.7679818 0.0952397 -0.0623641 0.324039 -0.3170758 0.0149281 -0.0280105 0.0281312 -0.1245708 0.7823892 0.6686032 -0.0146055 0.7296767 1.4519107 0.0286472 -0.0486023 -0.0515099 -0.0091097 0.733122 -0.0085218 0.022649 0.2220939 0.5459677 0.0208797 -0.0169284 -0.0087535 -0.0307738 0.0164962 -0.0420014 -0.0334859 -0.0765 0.1774273 -0.0036564 -0.0061417 0.001881 0.0255533 0.0777958 0.0120078 0.0598326 0.044393 -0.068642 -0.1233625 0.1026696 -0.0523122 -0.0593661 0.0573888 0.0624269 -0.0911848 0.0464148 0.0801108 0.0582875 -0.0861199 0.0291499 0.0853929 -0.0915956 -0.1274234 0.0798432 -0.1502441 0.0259589 0.0508371 0.0374281 -0.0135915 -0.0025213 0.1015826 0.009274 0.0128769 -0.0083431 0.0442676 -0.0557646 -0.1155509 -0.027873 -0.0328714 0.0232838 -0.0829377 0.0011894 0.0279325 -0.098558 -0.0062577 -0.0500386 0.0262132 0.0881764 -0.0835649 0.0253282 0.093812 -0.007949 0.1005055 0.0289703 0.1747207 -0.0029723 0.0212533 0.0811557 -0.0792891 0.0059363 -0.073001 0.0145642 -0.0092322 -0.0004081 -0.0094477 0.1788775 0.0554845 0.0850122 -0.0049914 0.061499 -0.0717412 0.0007169 0.0040274 0.0011369 0.1228779 0.013781 0.1040718 0.0968839 0.0305893 0.0497416 0.0133281 0.0742305 -0.0037388 -0.0353493 0.0235103 0.0807461 -0.0885645 0.0293646 0.0648129 -0.0402652 -0.061962 -0.0275562 0.0070384 0.044779 -0.0835432 0.0185113 -0.0747361 -0.0992653 0.0241131 0.0150216 0.025231 0.1258214 unknown
polarizability: 182.0809103|-1.5203021|158.5721924|-9.0263787|-8.9673195|106.1493858 unknown
InChI: InChI=1S/C8H11N3OS2/c1-11(2)8(13)12-6-4-5-9-7(10-6)14-3/h4-5H,1-3H3
charge 0 multiplicity 1
25 atoms
S  3.259137 1.590082 -0.000961
S  -1.537489 0.491772 -2.135317
O  -1.169347 -0.954711 0.187842
N  -3.052657 0.355274 0.143542
N  0.911328 0.171978 0.099013
N  2.996013 -1.086865 0.03584
C  -3.314025 -0.037313 1.544577
C  -4.06099 1.210391 -0.514268
C  -1.934422 0.001305 -0.557816
C  0.230152 -0.991845 0.079741
C  0.8523 -2.257588 0.052875
C  2.271695 0.074049 0.050856
C  2.266636 -2.23953 0.045459
C  1.888481 2.877546 -0.080839
H  -3.505283 0.86515 2.153699
H  -2.445781 -0.570544 1.950757
H  -4.1993 -0.698333 1.599645
H  -4.289045 0.821394 -1.520902
H  -3.683564 2.242607 -0.632424
H  -4.974605 1.217827 0.102033
H  0.27261 -3.180939 0.031389
H  2.841817 -3.171055 0.035366
H  1.322889 2.882154 0.861185
H  1.215352 2.645321 -0.917888
H  2.4006 3.839677 -0.237902
