program: Gaussian 09
title: 000299227
version: EM64L-G09RevD.01
frameworkgroup: C1[X(C10H8O2S)]
method: RPBEPBE
basis: SDD
operation: Freq
keyword: #p
keyword: freq=noraman
keyword: PBEPBE/SDD
title: #p freq=noraman PBEPBE/SDD
converged: YES YES NO NO
title: Mulliken charges:
elementType: S O O C C C C C C C C C C H H H H H H H H
charge: 0.286526 -0.269475 -0.168110 0.318425 0.446921 -0.375719 -0.351320 -0.780200 -0.716831 0.236699 -0.230260 -0.221019 -0.236110 0.305355 0.298939 0.224883 0.277589 0.260241 0.229193 0.231679 0.232594
chargesum: 0.00000
title: Mulliken charges with hydrogens summed into heavy atoms:
elementType: S O O C C C C C C C C C C
charge: 0.286526 -0.269475 -0.168110 0.318425 0.446921 -0.150836 -0.073731 -0.175906 -0.456591 0.236699 -0.001067 0.010660 -0.003516
polarizability: 2.06628683e+02 5.87941221e+00 1.36647109e+02 9.57275786e-01 -1.58865403e+00 6.19323095e+01
1716.lowfreq: -4.7826 -0.0028 0.0010 0.0018 6.8421 8.5370 38.4260 74.5099 99.8089
frequency: 38.3217 74.5071 99.8028 142.2108 163.6130 237.5627 284.4993 345.2471 356.1388 402.4708 419.1022 465.9485 507.2420 579.1319 604.6801 615.5589 629.0998 697.1123 717.9299 759.2624 777.5084 792.8581 799.5309 852.1546 853.7836 911.2058 930.7123 981.3797 987.6211 1000.4227 1002.6615 1032.9719 1079.3573 1088.8813 1175.0730 1181.1689 1195.2056 1232.1653 1250.5025 1270.1693 1322.5765 1381.5102 1419.1321 1436.7183 1481.3484 1580.2313 1605.9827 1611.8609 1680.2974 3036.2229 3127.9032 3136.9132 3149.4647 3152.5290 3164.3050 3179.8212 3204.1014
redmass: 4.3936 5.5714 5.4429 6.2444 4.9742 5.2125 6.8388 5.9253 6.2558 2.8368 4.2831 3.8199 6.8475 6.2595 3.9997 6.2760 7.2125 1.8301 5.6671 1.9039 3.3166 1.7237 4.9782 1.8502 2.0768 2.3506 1.4426 1.4295 5.4455 3.8817 1.4619 2.0099 2.5979 1.6456 1.0541 1.3830 1.1369 1.3765 1.4695 2.3357 1.3459 7.3271 1.0883 2.3281 2.2842 5.9458 8.6999 5.9936 11.8185 1.0624 1.0851 1.0884 1.0940 1.1023 1.0984 1.0970 1.0919
irintensity: 0.8500 2.1265 2.7298 0.9143 3.7661 1.0710 0.4002 1.1914 1.6077 0.1468 1.8353 3.2209 15.4694 1.7329 5.8887 0.9693 9.2660 37.0763 3.3642 98.6173 33.3136 2.3069 39.7107 4.0459 4.9609 4.6611 4.7487 0.3306 4.3512 80.5429 10.4825 7.5550 162.0009 34.1491 0.1270 66.4143 0.8673 10.5629 13.1588 36.9852 1.9511 0.1987 21.7930 10.4061 15.4254 3.8203 9.6009 4.4959 332.1040 8.1037 2.9451 3.1846 29.4686 0.1288 25.5378 6.6994 8.9433
temp: 298.150 k
press: 1.00000 atm
elementType: 16 8 8 6 6 6 6 6 6 6 6 6 6 1 1 1 1 1 1 1 1
symmnumber: 1
zpe: 401979.3 jmol-1
zpe.correction: 0.153106 hartree
zpe.thermalcorrener: 0.164117 hartree
zpe.thermalcorrenthalpy: 0.165061 hartree
zpe.thermalcorrgfe: 0.115088 hartree
zpe.sumelectzpe: -933.433805 hartree
zpe.sumelectthermal: -933.422794 hartree
zpe.sumelectthermalent: -933.421850 hartree
zpe.sumelectthermalfe: -933.471823 hartree
dipole: 1.5933 -2.9872 1.5998
dipole: 3.7445
quadrupole: -73.8317 -85.3869 -84.6256
quadrupole: 5.5155 -4.0787 -0.3413
quadrupole: 7.4497 -4.1055 -3.3442 5.5155 -4.0787 -0.3413
hfenergy: -933.5869108 hartree
pointgroup: C01 [X(C10H8O2S1)]
dipole: 0.7181564 1.214832 -0.4228284 debye
dipolederiv: -0.5069862 0.1532262 -0.0246633 -0.1274518 -0.055967 0.0452541 -0.0095911 0.0147949 0.0456521 -1.3789674 -0.6524055 -0.2231191 -0.1971794 -0.5755331 -0.0598412 -0.2647988 -0.0814049 -0.2438799 -0.7363551 -0.3199768 -0.1032705 -0.5620049 -0.9664827 -0.1068283 -0.0349553 0.063676 -0.2922188 0.2411576 -0.1033192 -0.04045 -0.1050855 -0.0396891 -0.0207494 -0.1116113 0.01267 0.0259166 0.4844363 0.2617123 0.0144979 0.4090806 0.5372814 0.1435434 0.2223731 -0.020724 0.0756433 -0.1255852 -0.0419131 0.0076456 -0.0107085 0.0342275 -0.0272485 0.0123168 -0.0144272 -0.1538757 -0.1234743 0.1105421 -0.0073534 0.0628992 -0.0277583 -0.0159498 0.0074531 -0.009503 -0.1342138 -0.0744377 0.1518458 0.0379492 0.2165561 -0.1718165 0.1155416 -0.044573 0.0872443 0.1773302 0.4510359 -0.1844305 -0.0239248 -0.0824717 -0.1841788 -0.0005772 0.038816 0.0148872 -0.3195392 1.6382094 0.6665737 0.3115961 0.5433549 1.1842752 -0.0048468 0.3006456 -0.0675884 0.2373239 -0.0034308 0.0963793 -0.0173489 0.161326 0.0458265 -0.0246389 -0.0271505 -0.0150066 -0.1403028 -0.0160748 -0.0969149 -0.0062145 -0.1215045 0.1372151 0.0013195 0.0021017 -0.0034961 -0.1501456 0.0085927 0.0001861 -0.0125043 -0.0419796 -0.0476451 0.0010895 -0.0079122 -0.0053986 -0.1597157 0.0976586 -0.0180166 0.0966302 -0.0225517 0.0530786 -0.0199661 -0.0135062 0.0035849 -0.0483431 -0.0106978 -0.0060029 -0.0245557 -0.0470555 0.0955292 -0.0323239 -0.0377407 -0.0184778 0.1098607 0.0680798 0.0943215 -0.0013836 0.0644767 -0.0621823 0.0181344 -0.010306 0.0042127 0.1441547 0.0928309 -0.0691463 0.014857 -0.0815324 0.027397 0.0079538 0.0230374 0.0032322 0.1564078 0.0017797 -0.0532002 -0.0366013 -0.0671535 0.0579884 -0.0425575 -0.0865589 0.0110073 0.1957436 -0.0171426 -0.0893645 0.0148854 -0.1184941 -0.0370162 0.0185032 0.0177047 0.0194975 0.156098 0.0388399 0.066039 0.0046805 0.0942996 -0.0921967 0.0028873 0.0028574 0.0032778 0.1567972 -0.1294691 0.0338643 0.0186475 0.0331801 0.0876466 0.0013007 0.0213983 -0.0020582 0.1613067 unknown
polarizability: 205.3843642|-10.8597602|136.2588627|-1.5570203|11.1589842|63.564874 unknown
InChI: InChI=1S/C10H8O2S/c11-10-7-13-6-9(12-10)8-4-2-1-3-5-8/h1-6H,7H2
charge 0 multiplicity 1
21 atoms
S  -2.873279 1.699239 0.569454
O  -1.203339 -0.884157 -0.040286
O  -3.15853 -2.020346 -0.377476
C  0.996664 0.10311 0.054086
C  -0.460897 0.32265 0.175314
C  1.897302 1.199412 -0.061247
C  1.521927 -1.219047 0.05741
C  -3.201684 0.405945 -0.772992
C  -1.076712 1.485804 0.541166
C  -2.578386 -0.923836 -0.381229
C  3.286484 0.977995 -0.144036
C  2.91289 -1.434422 -0.036039
C  3.802663 -0.339936 -0.1312
H  -2.76696 0.778601 -1.716158
H  -4.289089 0.287359 -0.865166
H  1.51358 2.224422 -0.112474
H  0.832595 -2.063781 0.137487
H  -0.50172 2.359387 0.848836
H  3.966743 1.832072 -0.23414
H  3.301775 -2.458524 -0.030989
H  4.882474 -0.509549 -0.20322
