program: Gaussian 09
title: 000299238
version: EM64L-G09RevD.01
frameworkgroup: C1[X(C17H18OS)]
method: RPBEPBE
basis: SDD
operation: Freq
keyword: #p
keyword: freq=noraman
keyword: PBEPBE/SDD
title: #p freq=noraman PBEPBE/SDD
converged: YES YES NO NO
title: Mulliken charges:
elementType: S O C C C C C C C C C C C C C C C C C H H H H H H H H H H H H H H H H H H
charge: 0.071863 -0.227215 0.134561 0.501654 -0.746262 -0.695567 -0.697564 -0.393899 -0.379218 -0.419218 -0.371466 0.353770 -0.402378 0.447601 -0.306230 -0.365497 -0.231157 -0.217706 -0.228843 0.218513 0.217907 0.215381 0.224925 0.208736 0.214521 0.209638 0.221759 0.216591 0.252270 0.230515 0.257808 0.257330 0.260642 0.264651 0.233802 0.233487 0.234297
chargesum: 0.00000
title: Mulliken charges with hydrogens summed into heavy atoms:
elementType: S O C C C C C C C C C C C C C C C C C
charge: 0.071863 -0.227215 0.134561 0.501654 -0.094461 -0.047385 -0.049576 -0.141629 -0.148703 -0.161410 -0.114136 0.353770 -0.402378 0.447601 -0.045588 -0.100847 0.002645 0.015781 0.005455
polarizability: 2.62074220e+02 -1.53949706e+01 2.12009656e+02 -2.74818015e+01 3.60803265e-01 1.57820137e+02
1716.lowfreq: -6.2053 -2.8423 -0.0016 -0.0012 0.0005 5.5079 22.8155 26.3202 47.1676
frequency: 22.6872 26.2833 47.1464 57.9248 73.0914 88.2425 138.8463 188.1184 190.8474 201.0071 230.0201 237.5622 256.1541 300.5353 309.7706 326.9505 337.8156 354.6319 393.9832 403.3398 410.5205 422.9138 452.8456 471.5725 503.7241 523.1136 552.3205 605.1739 612.9413 632.0408 662.3347 694.3847 702.6604 733.9954 779.6751 797.3762 828.9722 835.9292 840.8608 852.5553 919.0775 930.9988 939.0972 943.0202 952.9811 967.1487 978.6313 984.6636 988.1125 1001.8825 1004.4020 1019.7880 1024.7884 1031.9549 1064.9940 1105.9072 1115.6691 1125.6443 1156.2767 1174.8669 1191.2902 1199.5748 1204.5686 1215.4022 1265.9769 1272.0623 1304.0852 1318.0295 1365.5440 1375.6429 1377.3616 1382.2134 1404.5559 1408.9109 1434.1291 1459.8700 1464.9315 1466.5198 1474.8630 1478.3155 1486.2557 1489.4561 1498.7828 1579.1417 1588.0944 1602.7126 1610.9626 2971.9422 2972.9245 2978.0016 3068.0560 3068.1943 3069.9405 3076.5566 3077.0671 3080.2949 3128.0333 3130.9890 3140.7217 3152.1337 3152.4016 3162.3518 3163.3108 3173.5037 3173.7218
redmass: 3.2273 5.7256 4.5922 3.9324 4.6184 4.3292 4.8460 4.4418 3.2069 1.3150 4.5136 2.9570 1.0752 4.0166 1.0559 3.4451 3.3363 2.8118 4.1406 2.8300 2.9525 3.5521 3.1635 4.4820 5.8070 3.7631 2.6634 5.2413 6.1708 7.1633 5.4733 1.7490 6.0020 3.6155 1.9234 5.5042 1.2982 2.5599 1.6834 1.2489 1.7429 1.6410 1.4121 1.2146 1.3541 1.3707 7.0366 1.4278 5.7770 1.3386 2.9690 1.4300 1.3866 2.0178 2.5481 2.1959 1.5837 2.5387 2.4310 1.0560 1.1239 1.3481 2.9371 2.6789 4.5491 3.1293 1.2872 1.3562 5.9808 1.2018 1.2463 7.6946 1.2317 3.1602 2.2994 1.0509 1.0497 1.0961 2.2111 1.1433 1.0551 1.6254 1.1688 5.8006 7.3119 5.9929 6.4095 1.0348 1.0348 1.0358 1.1000 1.1001 1.1007 1.0995 1.0985 1.0995 1.0887 1.0852 1.0884 1.0932 1.0878 1.0951 1.0965 1.0986 1.0971
irintensity: 0.1714 1.1849 0.3299 0.3610 0.7783 0.3587 1.2185 1.2050 1.5764 0.1360 0.1422 1.0888 0.1251 1.2104 0.0296 0.5115 0.4965 2.0659 1.5512 0.2604 0.1804 1.6679 0.5184 2.6899 0.9496 3.6425 23.1025 11.6211 1.6318 0.7396 2.8615 49.6633 2.9205 3.6968 72.9035 8.6843 4.5484 5.1500 51.2073 2.1548 3.2229 2.6397 9.8649 0.3084 1.5269 0.1987 67.9088 0.3667 0.6114 1.8833 25.8553 8.2722 0.2666 3.0941 260.1655 74.5647 55.9757 194.0921 224.6882 0.5416 12.0682 26.9804 7.2453 1.8811 145.4911 48.7671 2.9395 9.2523 1.8587 20.2618 23.9025 5.4219 10.2794 4.7875 25.8349 0.0565 0.6194 7.4045 0.1516 26.6548 13.3016 46.3461 71.3027 1.7021 2.8493 15.0889 8.5684 30.7619 31.4706 30.3919 5.0007 4.6576 9.3584 40.7659 135.9647 40.7760 17.4464 0.0521 5.4495 11.2738 6.5709 9.0660 24.3282 10.3790 8.4955
temp: 298.150 k
press: 1.00000 atm
elementType: 16 8 6 6 6 6 6 6 6 6 6 6 6 6 6 6 6 6 6 1 1 1 1 1 1 1 1 1 1 1 1 1 1 1 1 1 1
symmnumber: 1
zpe: 784691.5 jmol-1
zpe.correction: 0.298873 hartree
zpe.thermalcorrener: 0.317113 hartree
zpe.thermalcorrenthalpy: 0.318057 hartree
zpe.thermalcorrgfe: 0.251120 hartree
zpe.sumelectzpe: -1130.510094 hartree
zpe.sumelectthermal: -1130.491854 hartree
zpe.sumelectthermalent: -1130.490910 hartree
zpe.sumelectthermalfe: -1130.557847 hartree
dipole: -3.0384 4.4372 0.1014
dipole: 5.3787
quadrupole: -118.4710 -123.5082 -113.5415
quadrupole: 12.8491 -3.8497 -1.7788
quadrupole: 0.0359 -5.0013 4.9654 12.8491 -3.8497 -1.7788
hfenergy: -1130.8089674 hartree
pointgroup: C01 [X(C17H18O1S1)]
dipole: -1.1948908 -1.691732 0.4339938 debye
polarizability: 251.9430282|29.0265138|207.3285534|33.3581619|-13.2281933|172.6324312 unknown
InChI: InChI=1S/C17H18OS/c1-17(2,3)14-9-11-15(12-10-14)18-16(19)13-7-5-4-6-8-13/h4-12H,1-3H3
charge 0 multiplicity 1
37 atoms
S  3.597619 2.600277 0.065612
O  1.433083 1.549409 -1.03571
C  -4.019178 -0.335171 -0.279924
C  -2.563277 0.143195 -0.491673
C  -4.777494 -0.525976 -1.618535
C  -4.792146 0.7170 0.571815
C  -4.00854 -1.699501 0.474664
C  -2.006577 0.371946 -1.776746
C  -1.726443 0.382395 0.633714
C  -0.672936 0.8085 -1.939538
C  -0.394456 0.820042 0.496699
C  0.125567 1.017243 -0.800469
C  2.525156 1.320634 -0.180022
C  2.715727 -0.057732 0.343925
C  2.238312 -1.190636 -0.376605
C  3.446413 -0.263722 1.54722
C  2.492217 -2.493654 0.096905
C  3.681836 -1.567643 2.025911
C  3.206582 -2.688139 1.302416
H  -5.809199 -0.865069 -1.413174
H  -4.844787 0.418032 -2.190593
H  -4.29652 -1.289094 -2.258224
H  -4.825819 1.69379 0.055601
H  -5.831405 0.378613 0.743052
H  -4.320371 0.871796 1.558499
H  -5.044159 -2.045345 0.65306
H  -3.481744 -2.471836 -0.115292
H  -3.504676 -1.620716 1.454843
H  -2.612604 0.214251 -2.673325
H  -2.119173 0.233862 1.646001
H  -0.252183 0.99684 -2.932079
H  0.222138 1.014367 1.379392
H  1.696253 -1.05043 -1.316433
H  3.827142 0.610462 2.086068
H  2.134555 -3.356977 -0.474499
H  4.238599 -1.712266 2.958027
H  3.395786 -3.702047 1.672116
