program: Gaussian 09
title: 000299240
version: EM64L-G09RevD.01
frameworkgroup: C1[X(C13H17NO3S)]
method: RPBEPBE
basis: SDD
operation: Freq
keyword: #p
keyword: freq=noraman
keyword: PBEPBE/SDD
title: #p freq=noraman PBEPBE/SDD
converged: YES YES NO NO
title: Mulliken charges:
elementType: S O O O N C C C C C C C C C C C C C H H H H H H H H H H H H H H H H H
charge: -0.024889 -0.283389 -0.265784 -0.297860 -0.039609 0.178407 0.263765 -0.311950 -0.339630 -0.734038 0.257158 -0.348883 -0.314684 -0.237648 -0.216822 -0.164322 -0.608383 -0.612054 0.213493 0.223928 0.231732 0.246378 0.241614 0.238900 0.235402 0.275710 0.258927 0.229304 0.231078 0.254055 0.218711 0.266021 0.235738 0.229331 0.270292
chargesum: 0.00000
title: Mulliken charges with hydrogens summed into heavy atoms:
elementType: S O O O N C C C C C C C C C C C C C
charge: -0.024889 -0.283389 -0.265784 -0.297860 -0.039609 0.178407 0.263765 0.125471 0.138480 -0.018122 0.257158 -0.073173 -0.055757 -0.008345 0.014257 -0.164322 0.130405 0.123307
polarizability: 1.95366161e+02 -1.68744369e+01 1.70251981e+02 8.07297430e+00 -7.53162606e+00 1.41683706e+02
1716.lowfreq: -11.5839 -4.4796 -0.0017 -0.0011 -0.0008 7.4332 30.4251 40.4445 46.2937
frequency: 30.1134 40.2366 45.7207 56.4988 74.8273 85.0682 93.5487 110.2625 113.0469 171.0085 182.0713 200.4346 205.4887 235.1044 249.2351 291.9416 306.1267 317.2588 338.8483 381.5627 421.5781 450.1624 482.0950 506.1358 520.6496 581.3442 586.8590 613.4773 635.7125 647.9589 670.3890 716.4592 749.7059 771.8633 783.9851 812.7904 838.1914 849.7216 876.3483 915.8232 936.2443 958.8059 961.8822 983.7245 994.3847 1030.9191 1055.0387 1057.3512 1066.8858 1088.9309 1090.3942 1113.5035 1120.3878 1140.1923 1150.4833 1161.6712 1167.0940 1175.9978 1180.5220 1201.3736 1234.6333 1261.5974 1267.7000 1315.1527 1319.0992 1377.2801 1379.1567 1399.7224 1423.9277 1432.4430 1453.2404 1455.0852 1459.1696 1464.8953 1467.8778 1480.6573 1482.7314 1483.7442 1489.8900 1524.0083 1584.0050 1611.6333 2972.3024 2995.2364 3003.3696 3009.1590 3013.5527 3055.3368 3072.0235 3087.1837 3109.6884 3110.1831 3114.6955 3114.7690 3120.2043 3133.1559 3149.0816 3162.3691 3175.5520
redmass: 3.6988 3.6600 2.7788 2.7750 3.0826 2.0375 1.3083 2.6207 2.0460 3.3648 3.8204 1.1991 3.0845 3.9131 3.4413 4.2977 4.4388 4.4485 4.0250 4.5860 3.5953 4.0370 4.3698 4.7509 4.6684 6.9800 5.0226 6.2174 6.0561 5.9132 3.9071 7.6622 3.3100 1.5063 2.6786 5.0178 1.4623 2.9968 1.4089 4.0218 3.8530 1.3931 5.3542 5.1096 1.3212 2.3702 2.3608 1.5555 6.4297 1.7070 1.2290 1.6401 1.7692 1.3653 1.9049 1.6969 1.1572 1.8720 1.6357 1.5605 2.8062 2.0648 3.0767 1.2680 1.2569 9.2290 1.2745 1.7348 1.1348 2.2602 1.1139 1.1319 1.0815 1.1255 1.8896 1.0884 1.0643 1.0682 1.0897 1.8859 6.9132 7.1066 1.0348 1.0342 1.0595 1.0347 1.0638 1.1019 1.1068 1.1003 1.0990 1.1045 1.1002 1.1024 1.1010 1.0857 1.0905 1.0954 1.0991
irintensity: 3.3884 0.0415 3.1541 2.3731 1.9020 1.1928 0.2198 1.5644 0.8012 4.0474 4.3315 1.8933 0.2149 0.6259 7.6264 3.5525 4.4597 4.0862 9.4599 4.1561 7.0577 10.5434 0.0154 6.6888 1.0100 11.2396 9.1488 1.3547 4.0937 3.4280 2.6798 1.7032 5.3455 67.7891 46.9269 6.1567 1.8992 10.3317 1.3899 55.0068 1.7290 0.6218 13.8489 41.4006 2.1828 13.8280 103.3201 18.3736 216.1003 10.9325 0.5807 2.9851 34.3153 2.2124 168.2163 52.0311 19.1071 75.8224 76.9668 21.2932 41.6026 30.2942 44.0469 0.9971 7.8905 3.9300 34.0889 89.6412 15.2334 35.7005 18.8399 21.9658 5.0496 12.4896 44.9122 5.7351 7.1639 12.2010 3.4882 230.2803 5.7031 8.0182 71.2884 46.3405 31.5663 9.8131 57.0315 30.9394 22.5268 21.2447 3.3181 34.3716 20.2966 11.1121 17.3461 2.7281 10.7650 18.8625 10.1081
temp: 298.150 k
press: 1.00000 atm
elementType: 16 8 8 8 7 6 6 6 6 6 6 6 6 6 6 6 6 6 1 1 1 1 1 1 1 1 1 1 1 1 1 1 1 1 1
symmnumber: 1
zpe: 731881.0 jmol-1
zpe.correction: 0.278759 hartree
zpe.thermalcorrener: 0.297478 hartree
zpe.thermalcorrenthalpy: 0.298423 hartree
zpe.thermalcorrgfe: 0.230459 hartree
zpe.sumelectzpe: -1182.679823 hartree
zpe.sumelectthermal: -1182.661103 hartree
zpe.sumelectthermalent: -1182.660159 hartree
zpe.sumelectthermalfe: -1182.728123 hartree
dipole: 1.1026 -1.1468 1.2931
dipole: 2.0501
quadrupole: -100.0128 -109.2231 -112.4296
quadrupole: -8.6170 10.5255 5.7593
quadrupole: 7.2091 -2.0013 -5.2078 -8.6170 10.5255 5.7593
hfenergy: -1182.958582 hartree
pointgroup: C01 [X(C13H17N1O3S1)]
dipole: 0.3869597 -0.3678755 0.6045474 debye
polarizability: 191.3823029|-17.4280785|169.0139701|10.6936449|-14.6781549|146.9055758 unknown
InChI: InChI=1S/C13H17NO3S/c1-13(15-8-9-16-13)10-6-4-5-7-11(10)17-12(18)14(2)3/h4-7H,8-9H2,1-3H3
charge 0 multiplicity 1
35 atoms
S  2.056663 0.447881 -1.959816
O  -2.472937 -1.621931 0.348331
O  -0.158358 -1.763717 0.13296
O  1.205386 0.711368 0.65641
N  3.154272 -0.412005 0.425941
C  -1.216651 -0.948951 0.755215
C  -1.203545 0.503999 0.238005
C  -2.219559 -2.24817 -0.977466
C  -0.688905 -2.092758 -1.211457
C  -1.086621 -1.047535 2.271791
C  -0.018026 1.277068 0.180634
C  -2.413832 1.135048 -0.141992
C  -0.018255 2.618858 -0.243308
C  -2.434795 2.479846 -0.57142
C  -1.234708 3.225319 -0.622404
C  2.15969 0.222973 -0.265438
C  3.054141 -0.629386 1.887487
C  4.296707 -1.027067 -0.268767
H  -2.809444 -1.730106 -1.755712
H  -2.541871 -3.299951 -0.89872
H  -0.189364 -3.019785 -1.530318
H  -0.452915 -1.273017 -1.914811
H  -1.062711 -2.109561 2.565187
H  -0.163931 -0.545984 2.605709
H  -1.949771 -0.558257 2.752586
H  -3.334839 0.545493 -0.090555
H  0.92801 3.16581 -0.281077
H  -3.383191 2.944164 -0.862757
H  -1.242102 4.268161 -0.95697
H  2.871901 0.321168 2.414308
H  4.002797 -1.064208 2.240548
H  2.22559 -1.322794 2.118407
H  4.273054 -2.126862 -0.148179
H  5.245679 -0.639903 0.146199
H  4.236343 -0.782007 -1.339955
