program: Gaussian 09
title: 000299271
version: EM64L-G09RevD.01
frameworkgroup: C1[X(C19H20N4O5)]
method: RPBEPBE
basis: SDD
operation: Freq
keyword: #p
keyword: freq=noraman
keyword: PBEPBE/SDD
title: #p freq=noraman PBEPBE/SDD
converged: YES YES NO NO
title: Mulliken charges:
elementType: O O O O O N N N N C C C C C C C C C C C C C C C C C C C H H H H H H H H H H H H H H H H H H H H
charge: -0.302486 -0.188724 -0.269251 -0.213098 -0.207197 -0.411873 -0.011998 0.024304 0.015433 0.039183 0.340416 0.328911 0.494012 -0.578483 -0.525067 -0.823296 -0.814048 -0.399894 -0.431819 0.310768 0.261897 0.541666 -0.291142 -0.498925 0.446644 -0.368771 -0.799324 -0.720649 0.242838 0.266104 0.261864 0.232592 0.228085 0.237574 0.232428 0.226129 0.258296 0.228228 0.214843 0.350490 0.292535 0.335862 0.292252 0.214925 0.251879 0.233087 0.223398 0.229406
chargesum: 0.00000
title: Mulliken charges with hydrogens summed into heavy atoms:
elementType: O O O O O N N N N C C C C C C C C C C C C C C C C C C C
charge: -0.302486 -0.188724 -0.269251 -0.213098 -0.207197 -0.061383 -0.011998 0.024304 0.015433 0.039183 0.340416 0.328911 0.494012 -0.335645 -0.258963 -0.100756 -0.117918 -0.141598 0.011252 0.310768 0.261897 0.541666 0.001392 -0.163063 0.446644 -0.076519 -0.099432 -0.267845
polarizability: 5.99702008e+02 -2.03095339e+01 3.43892442e+02 2.65761805e+00 9.97773221e+00 1.20302870e+02
1716.lowfreq: -24.4589 -2.1636 0.0005 0.0007 0.0008 4.0942 5.1871 10.8017 17.6169
frequency: -24.4059 10.4723 17.5619 29.8213 35.6919 39.9906 50.3063 58.4528 74.5114 80.5517 94.0153 117.3543 135.5436 143.0188 149.0433 161.8928 170.5033 182.2839 187.8533 195.6380 205.6420 244.2044 273.4745 285.4171 298.7372 316.7437 325.6982 340.3006 362.6174 375.3494 387.7415 413.2633 435.1807 438.4725 443.9790 456.7195 501.7518 513.9384 517.6176 540.6866 554.0686 571.5470 576.5593 613.2850 650.3322 658.8657 666.8225 681.4195 705.1529 706.0514 723.3494 752.6884 757.2337 779.6378 835.5231 837.3376 841.9499 860.1782 880.2070 890.3011 903.3251 923.3361 951.9379 956.0432 961.1807 964.1103 968.7665 972.9445 980.2678 1008.9995 1019.5700 1033.3148 1036.7266 1046.5638 1047.9812 1052.5294 1060.2418 1072.9554 1100.0653 1134.7213 1138.7312 1165.1127 1189.1900 1197.7186 1210.9498 1230.4297 1258.1583 1290.1454 1301.6470 1304.3253 1326.9826 1344.8133 1348.5348 1361.5047 1372.2456 1392.4807 1395.1962 1399.9253 1400.8125 1421.2628 1432.2267 1442.1842 1449.6275 1458.8659 1469.7365 1470.8286 1471.4807 1478.7518 1480.1054 1481.8823 1487.7540 1515.8758 1554.3528 1582.2475 1590.9201 1609.7683 1623.1452 1675.1809 2943.8458 2970.8281 2977.1746 2980.8228 3033.0582 3039.5873 3051.8245 3060.4026 3060.6182 3088.0872 3092.5626 3097.8111 3098.1970 3119.1081 3145.2497 3179.8630 3188.6114 3196.8618 3200.0352 3200.8782
redmass: 1.0291 7.4147 4.6080 4.0257 4.3963 4.7254 3.9459 11.9878 9.8428 4.5965 3.8870 4.9543 1.0269 7.0443 5.9137 4.9669 3.9659 4.5654 1.3920 2.9396 3.1657 2.9252 2.8038 7.2892 5.6445 4.8080 7.2259 5.4960 6.1155 4.9486 2.5579 5.1839 2.7534 6.3065 4.2029 4.0432 6.6073 3.7046 4.8379 3.7223 3.9701 4.5664 3.0481 6.9995 7.8653 6.9951 4.3192 1.6742 7.6988 3.0915 5.0429 7.2694 4.3447 5.0512 3.6188 1.4216 2.8752 1.3956 1.3759 6.8808 6.1227 1.3625 1.3700 2.3460 1.3445 1.4056 2.8206 1.5333 1.6172 1.3172 1.4802 1.5068 2.8922 1.6331 2.0019 1.6000 1.6210 3.2693 4.0832 2.1031 1.9139 8.4199 1.3403 1.3549 4.5224 1.8959 1.4133 1.6744 2.0729 2.5864 4.4589 5.4956 1.5239 7.6956 6.2543 1.2659 1.2742 1.3484 2.5498 2.7403 1.4139 2.2506 5.6417 1.0600 1.0745 1.1519 1.0610 2.6509 1.1093 1.1732 1.1327 3.7707 6.1095 5.4652 5.2748 6.0738 7.2195 5.0791 1.0628 1.0397 1.0403 1.0376 1.0994 1.0880 1.0939 1.0937 1.0966 1.0991 1.0637 1.0988 1.1001 1.0916 1.0918 1.0894 1.0919 1.1140 1.0798 1.0958
irintensity: 0.4538 0.0946 0.1980 0.8515 0.3030 0.7703 0.1357 0.0991 0.8588 1.6114 1.3143 5.1024 0.7143 0.2296 0.2912 3.7335 0.8622 5.7521 1.6647 2.3485 5.6991 12.5937 0.6066 0.3495 10.6798 4.8594 3.3316 1.7216 3.2155 0.9075 1.2017 21.9037 2.4766 2.7158 1.0375 4.9445 1.2743 11.2273 10.0669 4.5471 1.5933 0.5717 7.8915 4.0848 15.9479 7.3720 1.0804 3.3512 7.1294 6.5816 2.1433 8.3436 2.0836 9.6986 13.1517 70.1522 15.8206 12.4466 11.7258 2.6314 158.5767 0.6309 23.9354 11.7193 42.9850 23.0291 1.7484 32.8936 23.8152 0.0197 6.3343 10.9890 34.6695 12.9526 14.2301 16.6938 3.9634 63.4369 51.1797 95.5541 70.9420 322.0038 150.0984 63.5143 613.2243 152.4301 17.9717 201.1538 59.1921 19.8218 51.0127 245.3557 11.6317 42.5003 14.8887 24.1522 17.4952 6.2231 21.5394 15.0581 13.8236 40.2195 2.4160 9.8468 25.6861 6.8490 13.3873 89.8649 54.1507 8.7332 32.0784 57.9810 32.7608 75.6216 136.3000 0.3697 566.1941 14.4014 33.7456 20.5205 34.4018 33.9330 35.6876 22.8438 19.1386 7.7804 29.4329 15.8630 11.5010 29.2504 7.0114 20.5713 4.2080 3.6535 20.2181 17.0385 58.7943 2.9283
temp: 298.150 k
press: 1.00000 atm
elementType: 8 8 8 8 8 7 7 7 7 6 6 6 6 6 6 6 6 6 6 6 6 6 6 6 6 6 6 6 1 1 1 1 1 1 1 1 1 1 1 1 1 1 1 1 1 1 1 1
symmnumber: 1
zpe: 953427.7 jmol-1
zpe.correction: 0.363141 hartree
zpe.thermalcorrener: 0.389961 hartree
zpe.thermalcorrenthalpy: 0.390905 hartree
zpe.thermalcorrgfe: 0.302267 hartree
zpe.sumelectzpe: -1328.911714 hartree
zpe.sumelectthermal: -1328.884895 hartree
zpe.sumelectthermalent: -1328.883951 hartree
zpe.sumelectthermalfe: -1328.972589 hartree
dipole: -10.1292 2.7638 1.1834
dipole: 10.5660
quadrupole: -201.5065 -163.2692 -165.7482
quadrupole: -2.2640 -6.7543 -2.9657
quadrupole: -24.6652 13.5721 11.0931 -2.2640 -6.7543 -2.9657
hfenergy: -1329.2748556 hartree
pointgroup: C01 [X(C19H20N4O5)]
dipole: -3.9912507 -1.0487727 -0.5005355 debye
polarizability: 599.9745762|18.5832949|343.0236039|-0.9721413|15.3562094|120.8991397 unknown
InChI: InChI=1S/C19H20N4O5/c1-12(2)11-28-19-14(4)7-13(3)8-15(19)10-20-21-17-6-5-16(22(24)25)9-18(17)23(26)27/h5-10,21H,1,11H2,2-4H3
charge 0 multiplicity 1
48 atoms
O  -3.821128 0.922135 0.421005
O  4.087527 3.333377 0.437289
O  1.8555 2.877278 0.466196
O  6.76754 -2.276225 -0.430117
O  7.395961 -0.096135 -0.148773
N  1.016207 0.427765 0.170394
N  0.030903 -0.544394 0.06898
N  3.112528 2.496302 0.364548
N  6.499644 -1.022817 -0.244845
C  -3.672665 -0.473729 0.214289
C  -4.813321 -1.316535 0.184503
C  -2.352298 -1.014666 0.118321
C  -3.307449 -3.280039 -0.080746
C  -4.603078 -2.709858 0.0360
C  -2.191697 -2.419235 -0.03242
C  -6.212332 -0.748635 0.330938
C  -3.126497 -4.781243 -0.227029
C  -1.211339 -0.105393 0.193705
C  -4.175841 1.706228 -0.807022
C  2.344813 0.086742 0.067526
C  3.395105 1.077064 0.161917
C  -4.289206 3.164477 -0.419323
C  2.735366 -1.278788 -0.137344
C  4.754434 0.708555 0.059589
C  5.082337 -0.637013 -0.137882
C  4.074864 -1.639484 -0.238502
C  -3.088807 3.770352 0.278827
C  -5.410851 3.867686 -0.725117
H  -5.478474 -3.371667 0.021397
H  -1.17465 -2.820054 -0.101872
H  -6.195741 0.195564 0.900791
H  -6.873035 -1.463184 0.851291
H  -6.672129 -0.538906 -0.654717
H  -2.647761 -5.215686 0.670843
H  -2.480633 -5.026486 -1.089859
H  -4.092412 -5.294418 -0.371286
H  -1.446624 0.957783 0.37749
H  -5.12354 1.325446 -1.232023
H  -3.363749 1.550591 -1.550431
H  0.822478 1.441037 0.324505
H  1.938723 -2.021151 -0.208942
H  5.533627 1.471284 0.134508
H  4.37653 -2.678512 -0.393823
H  -2.174731 3.675778 -0.341054
H  -2.893042 3.241743 1.229859
H  -3.243845 4.83952 0.498746
H  -6.272963 3.398819 -1.214642
H  -5.495751 4.936223 -0.497787
