program: Gaussian 09
title: 000299223
version: EM64L-G09RevD.01
frameworkgroup: C1[X(C12H12O4)]
method: RPBEPBE
basis: SDD
operation: Freq
keyword: #pfreq=noraman
keyword: PBEPBE/SDD
title: #p freq=noraman PBEPBE/SDD
converged: YES YES NO NO
title: Mulliken charges:
elementType: O O O O C C C C C C C C C C C C H H H H H H H H H H H H
charge: -0.246546 -0.255390 -0.206488 -0.262144 -0.152566 0.294413 -0.528776 0.054021 0.110485 -0.381498 -0.356897 0.264544 -0.213142 -0.218290 -0.263677 -0.660112 0.275032 0.285370 0.271127 0.286572 0.269286 0.234420 0.236913 0.234863 0.228671 0.221462 0.231570 0.246777
chargesum: 0.00000
title: Mulliken charges with hydrogens summed into heavy atoms:
elementType: O O O O C C C C C C C C C C C C
charge: -0.246546 -0.255390 -0.206488 -0.262144 0.122466 0.294413 0.027720 0.054021 0.110485 -0.094926 -0.087611 0.264544 0.021278 0.018623 0.199857 0.039697
polarizability: 1.78443799e+02 -2.50362707e+00 1.48455943e+02 -1.09552962e+01 2.45204351e+00 8.41642949e+01
1716.lowfreq: -9.8027 -6.2187 0.0006 0.0007 0.0009 3.5004 22.5060 41.1093 52.6846
frequency: 22.1851 41.0737 52.6839 79.6981 100.5839 129.2840 154.2363 161.1386 221.2654 248.3053 262.2946 284.1634 317.7656 395.9815 416.6904 441.4958 492.1414 538.1234 545.4542 557.7925 587.2487 643.7549 665.5811 692.9649 733.4441 753.9926 785.9980 790.5333 801.8413 820.1381 898.7971 901.4515 928.4296 948.4160 971.7804 985.8924 1005.4408 1009.6609 1020.2672 1066.5428 1096.2641 1104.3065 1144.5794 1157.7345 1168.8077 1171.2813 1190.1511 1208.8040 1249.4298 1278.1534 1280.0019 1315.7659 1342.4617 1361.0304 1392.5795 1403.6313 1435.1907 1451.0145 1458.0863 1459.7768 1465.1415 1484.2842 1601.9258 1619.5854 1628.2526 1704.5453 2994.4109 3015.2970 3033.0978 3038.3075 3074.7857 3090.1392 3095.6402 3122.2634 3135.6676 3150.3065 3165.1446 3173.7406
redmass: 4.5811 3.2111 6.0292 4.2345 5.2360 3.6474 4.2527 3.7541 1.5790 2.8239 7.8544 4.2574 3.0493 3.6090 3.2978 3.7455 5.7563 4.1547 3.1998 7.6896 4.7222 5.2570 5.1490 5.8687 4.8259 2.9996 3.0543 1.6437 1.8620 2.2352 1.3390 3.6345 9.0167 3.8132 1.6045 2.4727 1.3387 2.7034 2.0739 3.4769 2.1781 2.0307 2.9885 1.7288 1.2659 1.1116 2.1858 1.5494 1.7034 1.1483 1.4115 1.6880 1.4601 1.4871 1.2306 7.5820 1.1065 2.4321 1.1594 2.2940 1.0431 1.0517 7.4826 7.3747 8.4924 12.9746 1.0361 1.0613 1.0597 1.0851 1.0995 1.0975 1.1029 1.1066 1.0864 1.0908 1.0959 1.0995
irintensity: 0.4013 0.5396 1.2344 1.0012 4.4786 5.2190 1.3782 0.5420 5.1592 3.5774 0.0992 5.8924 18.7109 3.8716 2.4338 1.1193 0.5265 8.9775 4.1531 4.7082 13.3525 5.9772 25.9274 4.4695 3.4620 27.8180 4.8630 45.6696 4.8573 1.1913 0.4227 25.7411 182.1975 22.1401 20.2686 62.2141 2.7081 70.3448 1.1695 4.1421 27.6962 8.4908 293.6946 50.1788 1.6210 5.9894 12.4710 4.5431 89.8806 3.3365 13.7549 20.2696 41.9276 25.4724 23.2343 4.9789 35.3092 8.7837 15.9273 13.3915 14.7710 12.4518 9.8722 22.8629 140.1626 416.1157 17.7481 7.0898 25.9325 4.1412 4.0391 31.4350 1.7057 30.5530 3.2115 7.0748 6.1167 17.2361
temp: 298.150 k
press: 1.00000 atm
elementType: 8 8 8 8 6 6 6 6 6 6 6 6 6 6 6 6 1 1 1 1 1 1 1 1 1 1 1 1
symmnumber: 1
zpe: 566647.8 jmol-1
zpe.correction: 0.215825 hartree
zpe.thermalcorrener: 0.230450 hartree
zpe.thermalcorrenthalpy: 0.231394 hartree
zpe.thermalcorrgfe: 0.172207 hartree
zpe.sumelectzpe: -764.224810 hartree
zpe.sumelectthermal: -764.210185 hartree
zpe.sumelectthermalent: -764.209241 hartree
zpe.sumelectthermalfe: -764.268428 hartree
dipole: -4.0421 4.4220 -0.8485
dipole: 6.0508
quadrupole: -82.2979 -98.2210 -95.0249
quadrupole: 15.2569 1.3485 -3.1959
quadrupole: 9.5500 -6.3730 -3.1770 15.2569 1.3485 -3.1959
hfenergy: -764.4406352 hartree
pointgroup: C01 [X(C12H12O4)]
dipole: -1.2827709 -1.8655638 -0.735733 debye
polarizability: 177.8903976|3.2928789|126.4047915|8.0215991|32.0659741|106.768848 unknown
InChI: InChI=1S/C12H12O4/c1-2-15-11(13)7-10-8-5-3-4-6-9(8)12(14)16-10/h3-6,10H,2,7H2,1H3
charge 0 multiplicity 1
28 atoms
O  0.733748 1.995759 1.061377
O  -3.159211 -0.838402 1.020963
O  2.900959 2.309547 1.894508
O  -2.112431 -0.491175 -1.036352
C  0.025039 0.991384 0.203761
C  1.109892 -0.005082 -0.177865
C  -1.145183 0.44236 1.042242
C  2.321704 0.385029 0.434171
C  2.113546 1.632117 1.21394
C  1.059109 -1.148126 -0.998529
C  3.513507 -0.348362 0.265922
C  -2.154983 -0.328078 0.208024
C  2.25175 -1.893207 -1.171384
C  3.465789 -1.502921 -0.546088
C  -4.262984 -1.595421 0.342592
C  -5.369539 -0.640348 -0.11018
H  -0.361281 1.53351 -0.677777
H  -1.66379 1.292654 1.522959
H  -0.776414 -0.199308 1.862274
H  0.12876 -1.441504 -1.493221
H  4.438013 -0.01885 0.750927
H  2.238831 -2.786318 -1.806101
H  4.370682 -2.099713 -0.70259
H  -3.833134 -2.150616 -0.509318
H  -4.608328 -2.294372 1.120538
H  -6.212363 -1.221654 -0.527851
H  -5.748776 -0.045184 0.738062
H  -5.004011 0.04408 -0.8941
