program: Gaussian 09
title: 000299214
version: EM64L-G09RevD.01
frameworkgroup: C1[X(C13H17NO)]
method: RPBEPBE
basis: SDD
operation: Freq
keyword: #p
keyword: freq=noraman
keyword: PBEPBE/SDD
title: #p freq=noraman PBEPBE/SDD
converged: NO YES NO NO
title: Mulliken charges:
elementType: O N C C C C C C C C C C C C C H H H H H H H H H H H H H H H H H
charge: -0.454618 -0.012811 0.368705 -0.294396 -0.488003 -0.771354 -0.739287 0.441343 -0.464265 -0.350747 -0.426280 -0.241820 -0.239247 -0.160554 -0.239280 0.206566 0.242775 0.231044 0.199553 0.254340 0.221142 0.208454 0.230276 0.238678 0.259778 0.265776 0.342425 0.264416 0.226791 0.225857 0.226038 0.228707
chargesum: 0.00000
title: Mulliken charges with hydrogens summed into heavy atoms:
elementType: O N C C C C C C C C C C C C C
charge: -0.112193 -0.012811 0.368705 -0.087830 -0.014184 -0.096319 -0.061879 0.441343 0.061288 -0.086332 -0.199490 -0.015963 -0.013209 -0.160554 -0.010573
polarizability: 2.00679605e+02 -5.09359958e+00 1.31103405e+02 -5.84925202e+00 -6.43404994e+00 9.67806365e+01
1716.lowfreq: -12.1659 -0.6405 -0.0008 -0.0006 -0.0006 11.7048 32.7414 52.7384 65.5320
frequency: 32.2002 52.7144 65.4858 78.4322 105.1502 130.1476 188.0346 195.0290 220.6241 228.4381 243.1919 255.0601 275.4914 317.6767 334.2469 367.4463 377.0858 395.0169 406.3228 450.8808 502.1777 528.2579 552.6483 616.6732 638.0488 707.6341 733.8150 755.1696 790.2021 825.8180 858.8012 889.5738 919.8929 931.0392 936.9546 939.3648 969.9084 979.2702 990.6216 995.9465 1000.2485 1021.3827 1028.3068 1036.9607 1084.9155 1140.1863 1143.0288 1167.8743 1172.7691 1189.0684 1211.3642 1226.1006 1237.4767 1277.5088 1296.5774 1308.0755 1324.1796 1346.8894 1368.5346 1378.4417 1390.8894 1397.7194 1440.3173 1451.6069 1461.4252 1474.6409 1477.5121 1482.4754 1484.6825 1497.2102 1593.4088 1615.2242 2197.6156 2931.8812 2971.9900 2981.0369 2986.5785 2995.2351 3034.8966 3058.7052 3059.1378 3073.9596 3085.4156 3090.1432 3115.2699 3127.0047 3140.7049 3158.0813 3173.4212 3573.1003
redmass: 5.1294 5.3536 3.8744 2.8321 3.4449 4.3459 1.9653 1.5156 4.2019 1.3137 2.2594 1.3883 2.3583 2.6196 2.4682 3.8408 3.6124 3.2353 2.8595 3.2912 3.9502 3.6011 3.7161 6.4009 4.7953 1.9420 2.1686 1.3172 2.3654 3.3681 1.2449 2.3081 1.7701 1.7542 3.4639 1.4567 2.7828 1.3771 5.6256 1.4881 1.9064 1.5476 2.2207 2.8672 1.6266 1.5509 1.5233 1.7195 1.0739 1.1215 2.6425 1.7265 1.6379 1.2653 1.3202 1.3634 1.3117 1.3976 2.1362 1.2001 3.0543 1.2046 2.0913 1.0785 1.0614 1.0565 1.0715 1.0739 2.2421 1.0568 6.0869 6.1093 12.4223 1.0833 1.0372 1.0378 1.0592 1.0597 1.0983 1.0982 1.1013 1.0990 1.0988 1.0987 1.0867 1.0871 1.0930 1.0980 1.0969 1.0660
irintensity: 2.3185 3.5396 1.4609 1.4897 3.0142 4.4434 1.9962 10.9461 6.6956 106.4137 14.6502 0.6484 3.2700 3.1942 8.1595 1.8970 0.6394 1.9855 0.4830 2.6863 5.2972 1.8388 5.1091 0.0635 10.6220 39.9554 73.8807 3.4137 13.6276 5.9921 0.0695 10.2017 4.8125 3.9937 2.3326 4.5733 32.6253 0.0248 0.1583 6.2792 15.8438 0.5174 8.7669 6.7494 8.4745 20.0737 37.1498 6.9099 0.8135 2.0026 28.5962 2.3928 11.0777 3.2145 5.2607 3.4729 8.2082 0.9787 6.3197 26.9066 2.9879 20.3814 10.8444 4.9635 1.6064 6.3962 9.0080 9.7064 11.7839 34.4120 0.6557 3.9181 18.6315 51.7442 30.7515 14.2314 9.8204 21.8474 1.7487 39.6274 13.0862 34.8540 19.6024 42.5430 9.0630 1.8445 32.1762 30.9604 6.9055 4.4080
temp: 298.150 k
press: 1.00000 atm
elementType: 8 7 6 6 6 6 6 6 6 6 6 6 6 6 6 1 1 1 1 1 1 1 1 1 1 1 1 1 1 1 1 1
symmnumber: 1
zpe: 701380.6 jmol-1
zpe.correction: 0.267142 hartree
zpe.thermalcorrener: 0.282884 hartree
zpe.thermalcorrenthalpy: 0.283828 hartree
zpe.thermalcorrgfe: 0.223998 hartree
zpe.sumelectzpe: -634.406480 hartree
zpe.sumelectthermal: -634.390738 hartree
zpe.sumelectthermalent: -634.389794 hartree
zpe.sumelectthermalfe: -634.449624 hartree
dipole: -2.8876 1.7718 1.1311
dipole: 3.5716
quadrupole: -117.6834 -86.5539 -92.7511
quadrupole: 0.9114 1.8474 -2.9692
quadrupole: -18.6873 12.4422 6.2450 0.9114 1.8474 -2.9692
hfenergy: -634.6736219 hartree
pointgroup: C01 [X(C13H17N1O1)]
dipole: 1.1343804 -0.6190265 0.5518486 debye
polarizability: 200.6486807|-4.197766|132.2677735|6.7356731|0.7020618|95.6471916 unknown
InChI: InChI=1S/C13H17NO/c1-13(2,9-6-10-14)12(15)11-7-4-3-5-8-11/h3-5,7-8,12,15H,6,9H2,1-2H3
charge 0 multiplicity 1
32 atoms
O  -0.246833 1.402488 -1.228489
N  -5.62078 -0.044163 -0.668127
C  -0.811327 0.096452 0.856667
C  -0.016446 0.131878 -0.512228
C  -2.33109 0.366404 0.598303
C  -0.630319 -1.286512 1.533945
C  -0.304307 1.208792 1.8094
C  1.495478 -0.01158 -0.372999
C  -3.03481 -0.62447 -0.376802
C  2.326186 1.130784 -0.254062
C  2.094735 -1.296135 -0.373208
C  3.724382 0.988072 -0.116014
C  3.493147 -1.441585 -0.228897
C  -4.464254 -0.311542 -0.543285
C  4.313638 -0.297937 -0.095559
H  -0.383937 -0.71854 -1.129614
H  -2.853493 0.314461 1.571989
H  -2.47714 1.403183 0.236608
H  -0.910443 -2.12616 0.868756
H  0.419582 -1.440582 1.835262
H  -1.257618 -1.350387 2.442788
H  -0.929861 1.251482 2.720681
H  -0.341198 2.196264 1.314976
H  0.738019 1.021672 2.119703
H  -2.563557 -0.614751 -1.378763
H  -2.947468 -1.659079 0.003655
H  -1.20514 1.481651 -1.462498
H  1.869136 2.123281 -0.300482
H  1.469577 -2.189285 -0.498112
H  4.355368 1.880176 -0.031261
H  3.940478 -2.441983 -0.232708
H  5.398995 -0.407049 0.009676
