program: Gaussian 09
title: 000299198
version: EM64L-G09RevD.01
frameworkgroup: C1[X(C13H14O)]
method: RPBEPBE
basis: SDD
operation: Freq
keyword: #pfreq=noraman
keyword: PBEPBE/SDD
title: #p freq=noraman PBEPBE/SDD
converged: NO YES NO NO
title: Mulliken charges:
elementType: O C C C C C C C C C C C C C H H H H H H H H H H H H H H
charge: -0.279305 0.241561 0.134440 0.430942 0.191640 -0.476389 -0.379250 -0.384661 -0.836034 -0.432887 -0.254642 -0.252661 -0.237593 -0.687111 0.233881 0.243265 0.245572 0.275494 0.226756 0.226839 0.237551 0.223078 0.225665 0.206996 0.206921 0.206897 0.231511 0.231524
chargesum: 0.00000
title: Mulliken charges with hydrogens summed into heavy atoms:
elementType: O C C C C C C C C C C C C C
charge: -0.279305 0.241561 0.134440 0.430942 0.191640 -0.242508 -0.135985 -0.139089 -0.106944 -0.195336 -0.031565 -0.026996 0.176323 -0.017179
polarizability: 2.32126487e+02 6.03644542e+00 1.50425807e+02 2.04529836e-02 1.50860272e-04 7.09088836e+01
1716.lowfreq: -0.0013 -0.0007 -0.0006 7.8294 11.4810 18.5005 45.5390 108.3894 120.8176
frequency: 45.4895 108.3839 120.8168 129.9278 141.1069 168.0917 222.6649 244.6382 276.4461 302.7900 321.9525 335.8736 419.1165 451.6744 489.0364 527.9125 539.4433 544.5748 583.8322 666.0258 691.9708 711.6980 755.8353 790.6647 810.0213 829.4395 835.5518 851.4058 876.8203 926.0262 944.1667 965.0613 987.7103 1022.4518 1031.5237 1041.2299 1062.3997 1083.4677 1116.1921 1134.2689 1155.7199 1173.9666 1196.5820 1227.9095 1243.6816 1264.4556 1271.5522 1359.5203 1370.4496 1395.6242 1397.1586 1405.9879 1418.9398 1437.9228 1459.1743 1460.8649 1477.8600 1479.4587 1487.7348 1490.5875 1514.9920 1583.7053 1602.6130 1634.1759 2954.4622 2974.9237 2996.1619 3013.4073 3044.0688 3093.6798 3105.2506 3116.8944 3119.2351 3127.6444 3128.8626 3148.8353 3162.5245 3165.9796
redmass: 3.8509 1.7669 3.5795 3.3992 3.1395 1.1082 3.5517 1.1631 3.3020 4.5089 4.6073 3.2125 3.0739 4.2990 5.3859 3.2068 3.0523 5.6198 5.3086 3.0967 5.2634 5.2586 1.3105 2.8414 1.3752 3.6418 1.1386 4.1279 1.6615 2.4072 1.3387 1.4100 1.3289 2.2688 2.4675 1.5085 3.1317 2.3673 2.1661 1.4280 1.3766 1.1058 1.5884 2.1610 2.9697 1.1446 1.6939 1.7156 1.9309 1.2592 1.3367 2.5480 3.2562 3.7435 1.9653 1.0401 1.1558 1.1811 1.0467 1.1223 3.5360 7.4372 5.6660 6.7818 1.0552 1.0400 1.0361 1.1076 1.0972 1.0989 1.1014 1.0862 1.0951 1.0887 1.0883 1.0941 1.0995 1.0941
irintensity: 1.4881 3.3219 0.1974 0.9529 0.0890 1.1387 6.3022 0.4936 0.1297 1.2354 0.0966 0.2159 5.2882 0.6671 2.3057 5.4786 4.3287 7.1879 0.8819 0.6523 14.7489 4.9471 35.8409 9.9540 86.0923 4.7197 3.8058 0.2590 2.6585 18.4013 0.0409 4.6577 0.0353 6.7436 36.6759 1.3053 7.5197 169.7258 23.7693 4.6718 15.0602 4.7531 31.6951 146.6867 102.2284 0.0463 13.3876 12.0420 10.7300 16.3936 49.1556 8.0969 0.6159 4.8401 21.4125 13.0459 44.0640 8.3487 12.7960 5.1637 41.3774 0.3871 43.1742 45.7353 52.3330 29.4711 28.3953 36.1042 22.4155 31.1139 35.4851 3.0124 6.2639 2.1491 17.7578 32.0625 38.1006 14.5358
temp: 298.150 k
press: 1.00000 atm
elementType: 8 6 6 6 6 6 6 6 6 6 6 6 6 6 1 1 1 1 1 1 1 1 1 1 1 1 1 1
symmnumber: 1
zpe: 608721.4 jmol-1
zpe.correction: 0.231850 hartree
zpe.thermalcorrener: 0.244544 hartree
zpe.thermalcorrenthalpy: 0.245488 hartree
zpe.thermalcorrgfe: 0.193054 hartree
zpe.sumelectzpe: -578.002786 hartree
zpe.sumelectthermal: -577.990092 hartree
zpe.sumelectthermalent: -577.989147 hartree
zpe.sumelectthermalfe: -578.041582 hartree
dipole: -1.5796 -1.0411 0.0021
dipole: 1.8918
quadrupole: -69.2886 -74.7237 -88.2336
quadrupole: 4.3278 0.0019 0.0014
quadrupole: 8.1267 2.6916 -10.8183 4.3278 0.0019 0.0014
hfenergy: -578.2346356 hartree
pointgroup: C01 [X(C13H14O1)]
dipole: -0.6156673 0.4130716 0.0657196 debye
polarizability: 231.6228621|-6.3412924|149.8569269|-8.0034333|7.5984974|71.9813882 unknown
InChI: InChI=1S/C13H14O/c1-3-14-13-9-8-11-6-4-5-7-12(11)10(13)2/h4-9H,3H2,1-2H3
charge 0 multiplicity 1
28 atoms
O  -2.640431 -0.411832 0.188127
C  1.067596 -0.543195 0.005352
C  -0.31348 -0.952493 0.031409
C  1.417873 0.860748 0.118862
C  -1.305938 0.040134 0.168836
C  0.370227 1.824173 0.25592
C  -0.965903 1.428895 0.280967
C  2.137435 -1.495087 -0.132735
C  -0.700587 -2.41428 -0.086683
C  2.79725 1.252133 0.091449
C  3.47196 -1.084611 -0.156583
C  3.810476 0.301997 -0.043559
C  -3.721965 0.582029 0.329641
C  -5.034293 -0.198107 0.316354
H  0.629376 2.885984 0.341895
H  -1.750351 2.183879 0.385976
H  1.898801 -2.559758 -0.221002
H  -1.793468 -2.528288 -0.047323
H  -0.34211 -2.84962 -1.039228
H  -0.261221 -3.014449 0.73305
H  3.042502 2.317804 0.179278
H  4.271402 -1.826938 -0.262711
H  4.862114 0.60839 -0.063806
H  -3.595514 1.136955 1.282025
H  -3.676329 1.304216 -0.511313
H  -5.888916 0.495135 0.419914
H  -5.146369 -0.754367 -0.629953
H  -5.065437 -0.920346 1.149942
