program: Gaussian 09
title: 000299195
version: EM64L-G09RevD.01
frameworkgroup: C1[X(C19H16Cl2)]
method: RPBEPBE
basis: SDD
operation: Freq
keyword: #p
keyword: freq=noraman
keyword: PBEPBE/SDD
title: #p freq=noraman PBEPBE/SDD
converged: YES YES NO NO
title: Mulliken charges:
elementType: Cl Cl C C C C C C C C C C C C C C C C C C C H H H H H H H H H H H H H H H H
charge: 0.001323 0.010353 0.397300 0.084932 0.237897 0.182794 0.262415 -0.653073 -0.576393 0.279113 -0.404946 -0.390987 -0.853021 -0.550623 -0.262746 -0.263309 -0.416319 -0.405265 -0.230777 -0.232320 -0.242517 0.261169 0.277783 0.247711 0.247939 0.270749 0.242936 0.238732 0.241729 0.338872 0.228035 0.230068 0.261682 0.253429 0.227573 0.227550 0.230211
chargesum: 0.00000
title: Mulliken charges with hydrogens summed into heavy atoms:
elementType: Cl Cl C C C C C C C C C C C C C C C C C C C
charge: 0.001323 0.010353 0.397300 0.084932 0.237897 0.182794 0.262415 -0.391903 -0.050898 0.279113 -0.157007 -0.120238 -0.129623 -0.211751 -0.034710 -0.033240 -0.154638 -0.151836 -0.003204 -0.004770 -0.012306
polarizability: 2.99556045e+02 -1.16317570e+01 2.74163285e+02 1.62350606e+01 -2.90037703e-01 1.29467733e+02
1716.lowfreq: -5.6940 -0.0023 -0.0018 -0.0018 4.1144 6.7035 30.0694 31.9504 43.3281
frequency: 29.8600 31.8838 43.3220 56.4350 68.1841 83.8927 121.0567 142.5231 188.1366 191.5734 215.3374 226.3103 247.1678 263.8256 292.0228 308.2388 344.7088 383.0855 406.2436 411.7780 441.2231 466.4990 481.7036 495.5935 529.1765 575.7048 587.4300 605.0564 611.2597 632.1001 646.7440 656.9785 694.9021 706.9772 723.4356 766.1714 773.5202 778.9074 797.9498 856.4949 881.0442 883.3671 902.5342 917.0768 927.0182 948.4432 967.2823 979.5308 988.2345 994.0695 998.5166 1027.6467 1032.5377 1033.7359 1047.8522 1064.9738 1076.1586 1082.8784 1153.7389 1156.4585 1172.7631 1179.9825 1182.4526 1191.6171 1191.9097 1244.5541 1265.8728 1273.2994 1299.7330 1311.8229 1328.6666 1361.2006 1376.2307 1382.6500 1400.0517 1407.9455 1430.2670 1433.7235 1449.6743 1460.6542 1483.9122 1485.7370 1491.3007 1520.4566 1578.7642 1583.5881 1598.9515 1610.1358 1622.4041 2977.0912 3016.5455 3047.0281 3075.1972 3100.4910 3122.1668 3127.0010 3128.7411 3134.9990 3135.8773 3139.6104 3144.6497 3148.5348 3160.9964 3164.0440 3170.1358
redmass: 10.7304 10.5353 5.6991 4.8168 4.0516 4.4879 5.5415 3.6375 1.1347 11.3821 4.4617 4.0470 6.2102 4.6150 8.6431 4.0816 3.6464 3.4913 2.8241 2.5082 3.5752 4.4322 4.9771 4.1008 3.8429 4.1758 4.6029 5.0061 5.7108 4.6127 5.4428 4.0019 4.9786 1.8323 4.0164 2.3635 2.1387 1.9124 2.7189 1.2586 2.0223 1.7819 1.7282 4.2915 1.4916 1.8636 1.3662 1.3789 5.8886 1.3244 1.3073 2.2473 2.4118 1.6804 3.1844 2.4582 2.1468 1.7401 1.4106 2.7533 1.0531 1.4054 1.1556 1.1054 1.1112 1.6398 1.3746 1.4924 2.5069 1.4732 1.4124 3.3399 6.0054 2.4164 1.5650 3.3619 2.8621 2.4671 1.7351 1.3855 1.6118 1.3731 1.1591 3.3986 5.5881 6.4494 6.5665 6.0847 6.2698 1.0402 1.0613 1.0970 1.0997 1.0947 1.0846 1.0876 1.0855 1.0905 1.0903 1.0922 1.0896 1.0964 1.0940 1.1015 1.0992
irintensity: 0.2810 0.6370 0.1607 0.1117 0.3167 0.3639 0.5439 0.4225 0.8673 0.4410 4.9376 0.3170 0.6028 0.4674 1.1589 1.5475 2.6875 2.3696 0.8564 5.7332 3.0611 4.9842 2.3319 10.6542 5.1038 21.5959 11.6165 23.4167 8.2971 58.5413 21.2596 5.1028 7.6972 55.4595 35.6307 37.7289 19.7771 78.5246 3.4699 0.9434 5.3415 1.3679 2.7780 8.4531 4.2784 14.2677 1.0092 0.6068 0.4252 0.1141 0.1360 10.5845 17.8206 5.0964 15.9018 0.4193 5.1833 4.7530 0.9212 1.4932 0.0071 0.9223 1.1095 3.4012 8.4484 5.3990 7.4918 5.0380 1.5948 1.2846 8.5597 2.1005 0.6496 20.2187 14.6566 8.4865 6.1567 7.5322 7.2784 10.8365 12.1637 6.8495 21.6203 6.1525 4.5954 2.1348 9.3877 4.1103 0.1618 32.5021 11.9698 14.5191 3.3280 26.8906 4.3693 0.7116 2.3436 0.7084 14.2487 14.9235 16.3334 29.0882 13.8258 34.8199 27.0047
temp: 298.150 k
press: 1.00000 atm
elementType: 17 17 6 6 6 6 6 6 6 6 6 6 6 6 6 6 6 6 6 6 6 1 1 1 1 1 1 1 1 1 1 1 1 1 1 1 1
symmnumber: 1
zpe: 759987.2 jmol-1
zpe.correction: 0.289464 hartree
zpe.thermalcorrener: 0.307941 hartree
zpe.thermalcorrenthalpy: 0.308885 hartree
zpe.thermalcorrgfe: 0.240925 hartree
zpe.sumelectzpe: -1652.299415 hartree
zpe.sumelectthermal: -1652.280938 hartree
zpe.sumelectthermalent: -1652.279994 hartree
zpe.sumelectthermalfe: -1652.347954 hartree
dipole: 1.6582 2.1902 -0.7538
dipole: 2.8487
quadrupole: -134.9523 -125.3369 -139.8180
quadrupole: -10.5936 2.0107 0.6542
quadrupole: -1.5832 8.0322 -6.4490 -10.5936 2.0107 0.6542
hfenergy: -1652.588879 hartree
pointgroup: C01 [X(C19H16Cl2)]
dipole: 0.4105474 -0.9406231 0.4503413 debye
polarizability: 304.7548454|3.4740207|268.7319306|-5.9572061|-14.9916288|129.7002868 unknown
InChI: InChI=1S/C19H16Cl2/c1-13-15(12-19(20)21)11-18(14-7-3-2-4-8-14)17-10-6-5-9-16(13)17/h2-11,19H,12H2,1H3
charge 0 multiplicity 1
37 atoms
Cl -5.275495 2.57677 -0.362986
Cl -2.645006 2.548187 -1.933023
C  -1.781995 0.371439 0.423194
C  -1.960295 -1.025073 0.361031
C  -0.796984 -1.867333 0.168916
C  0.528942 -1.285695 0.053085
C  0.681892 0.149602 0.165839
C  -0.467505 0.929007 0.331827
C  -2.946668 1.342018 0.598181
C  2.01202 0.831848 0.116738
C  -0.92519 -3.294612 0.062703
C  1.641604 -2.15214 -0.215475
C  -3.330273 -1.675665 0.479268
C  -3.702435 1.601825 -0.709257
C  0.182052 -4.113048 -0.170014
C  1.477738 -3.534322 -0.324354
C  3.080625 0.448919 0.973937
C  2.214637 1.92842 -0.765204
C  4.312884 1.137584 0.945311
C  3.44842 2.614736 -0.797771
C  4.504332 2.221243 0.056421
H  -0.358761 2.015743 0.419579
H  -2.589325 2.310035 0.989177
H  -3.6844 0.96004 1.327432
H  -1.913903 -3.753724 0.154258
H  2.631885 -1.7105 -0.358268
H  -3.35174 -2.417327 1.299657
H  -4.129903 -0.946689 0.681606
H  -3.602616 -2.214748 -0.448523
H  -4.0262 0.696491 -1.237397
H  0.056247 -5.198505 -0.250072
H  2.340278 -4.175239 -0.537302
H  2.932086 -0.370959 1.685644
H  1.404225 2.226955 -1.440292
H  5.120055 0.833172 1.62119
H  3.58654 3.451515 -1.491718
H  5.462032 2.753034 0.032258
