program: Gaussian 09
title: 000299175
version: EM64L-G09RevD.01
frameworkgroup: C1[X(C10H10O3)]
method: RPBEPBE
basis: SDD
operation: Freq
keyword: #pfreq=noraman
keyword: PBEPBE/SDD
title: #p freq=noraman PBEPBE/SDD
converged: YES YES NO NO
title: Mulliken charges:
elementType: O O O C C C C C C C C C C H H H H H H H H H H
charge: -0.240625 -0.402828 -0.220624 0.041572 0.433945 -0.176986 0.350025 -0.687134 0.149187 -0.423636 -0.352261 -0.213090 -0.819284 0.230160 0.237587 0.246724 0.257480 0.238663 0.232686 0.286979 0.234527 0.231876 0.365056
chargesum: 0.00000
title: Mulliken charges with hydrogens summed into heavy atoms:
elementType: O O O C C C C C C C C C C
charge: -0.240625 -0.037773 -0.220624 0.041572 0.433945 -0.176986 0.350025 0.027337 0.149187 -0.166156 -0.113598 0.019596 -0.065901
polarizability: 1.44141302e+02 -3.52787249e+00 1.32389511e+02 -3.78846003e-01 4.19164765e-01 6.52076176e+01
1716.lowfreq: -69.8659 -4.1855 -0.0003 0.0006 0.0007 9.3510 13.0772 67.2729 109.5260
frequency: -69.8550 67.2714 109.5176 139.4021 210.0351 214.9869 233.7253 282.0032 296.8054 307.8105 352.2323 380.3080 446.5457 467.3222 485.4655 538.1886 587.6536 599.4355 604.0439 628.1710 669.8481 771.2048 779.2890 802.9160 819.7798 864.2036 916.5326 940.3147 956.1978 990.6511 999.5614 1046.6584 1060.8868 1089.9304 1105.8161 1143.2804 1176.6227 1195.5405 1220.3211 1263.3681 1359.5212 1390.6760 1397.4781 1407.4669 1426.1602 1457.6694 1464.2620 1473.8331 1477.7706 1487.6992 1610.7005 1621.3910 1690.5360 2983.3709 2997.0686 3058.0399 3095.7906 3111.0357 3115.9743 3127.2303 3146.7372 3166.3791 3545.2271
redmass: 1.0332 3.9242 6.3730 3.9707 1.7308 3.2428 1.6079 2.6308 2.1389 4.4036 1.9537 3.6670 4.5641 5.3154 4.0964 4.7526 4.5889 5.2928 6.0601 4.6275 4.7469 5.1633 3.5455 1.6151 7.0803 4.7975 1.3585 2.3400 3.6089 1.3531 1.7789 1.5534 1.8179 1.5154 2.0888 4.9806 1.2953 3.3226 2.3781 1.8359 2.2546 1.2366 1.2417 4.9027 2.2150 1.0894 1.2397 1.7986 1.4284 1.0473 6.9688 7.5257 12.3098 1.0389 1.0359 1.0969 1.0997 1.1005 1.0982 1.0875 1.0920 1.0987 1.0654
irintensity: 0.5594 2.2242 1.8770 1.1477 1.9692 1.8758 1.5891 9.2615 59.8737 3.1551 81.8231 3.8942 22.8855 1.8767 18.3209 0.9308 2.3402 13.8515 2.1574 7.7813 22.8405 7.9668 4.5473 60.4660 114.7912 66.4521 1.2462 16.3092 158.9394 0.9661 12.8583 7.3272 26.5515 117.3424 37.0349 56.6037 8.5685 65.8073 8.1074 5.6378 57.7423 22.6519 34.4048 7.4432 22.5296 13.9632 5.0112 22.9490 10.0185 16.5276 19.2995 14.8103 333.7313 20.6863 11.4902 15.5590 16.5256 15.5157 1.4001 5.3786 15.2184 15.6023 12.3446
temp: 298.150 k
press: 1.00000 atm
elementType: 8 8 8 6 6 6 6 6 6 6 6 6 6 1 1 1 1 1 1 1 1 1 1
symmnumber: 1
zpe: 462810.4 jmol-1
zpe.correction: 0.176275 hartree
zpe.thermalcorrener: 0.187416 hartree
zpe.thermalcorrenthalpy: 0.188360 hartree
zpe.thermalcorrgfe: 0.139776 hartree
zpe.sumelectzpe: -611.810462 hartree
zpe.sumelectthermal: -611.799321 hartree
zpe.sumelectthermalent: -611.798377 hartree
zpe.sumelectthermalfe: -611.846961 hartree
dipole: 0.0524 -4.3894 1.3071
dipole: 4.5802
quadrupole: -58.1286 -83.2611 -77.9827
quadrupole: 0.3605 1.1635 -1.7080
quadrupole: 14.9955 -10.1369 -4.8586 0.3605 1.1635 -1.7080
hfenergy: -611.9867373 hartree
pointgroup: C01 [X(C10H10O3)]
dipole: -0.1294303 1.6987609 -0.5870759 debye
dipolederiv: -1.250886 -0.3560817 0.0153718 -0.446772 -0.8273981 -0.0500705 0.03749 0.069192 -0.3955376 -0.5238945 -0.234991 -0.1843487 -0.2858696 -0.487294 0.0419104 -0.3202113 -0.0777741 -0.7821032 -0.6375565 -0.1268117 0.0100959 -0.1894836 -1.2270776 0.0592417 0.0056355 0.039793 -0.3100882 0.9357948 0.1532704 0.1004998 0.5405885 0.8128107 0.0663973 0.2431548 0.0650013 0.9027162 -0.0771689 0.0635713 -0.0376027 -0.1847865 0.0774747 0.0079507 0.0616984 -0.0211456 -0.0952088 -0.3229535 0.09693 0.0073435 0.2468559 -0.5277076 0.0244123 -0.017222 0.0271388 -0.0012567 0.288881 0.0961904 0.0011439 0.3449622 0.3030165 -0.010302 -0.025143 -0.009236 0.0180645 -0.1324885 -0.0404696 0.1290605 -0.0514206 -0.0164398 0.0052486 -0.0005864 0.031769 -0.166646 1.5855702 0.2459466 -0.010274 0.0383957 1.7054308 -0.087587 -0.005242 -0.0897077 0.2465542 -0.1800823 0.1598601 0.0105739 0.1621903 -0.0312764 -0.0075717 0.0294662 0.018035 -0.1344857 0.0842974 -0.0691676 0.0098157 -0.2183068 -0.2751626 0.0041749 0.0117178 0.0037952 -0.179495 0.1446005 -0.0456946 -0.0011249 -0.0105768 0.1321382 -0.008001 -0.0070941 -0.0042695 -0.1161535 -0.199156 -0.1440294 0.0079676 -0.0835997 -0.1029106 0.0067753 0.0072929 0.0028209 0.0501539 0.0857201 -0.0130129 0.0161616 -0.0645597 -0.1103594 0.0195923 0.0263859 -0.0061835 0.0844642 -0.1125369 0.0717279 0.0067836 0.0993056 0.0673969 0.0204179 -0.0196679 0.0287742 0.0752159 0.0709947 -0.0364285 -0.0909197 -0.0285874 0.0823319 -0.0505274 -0.0845096 -0.0340583 -0.0481433 0.0253478 -0.096349 0.0027998 -0.0705298 0.0025378 0.0080658 0.000264 0.0020074 0.1540583 -0.115079 0.0379462 -0.0039929 0.0147446 0.0860113 0.0022513 -0.0031926 0.003202 0.1495486 0.0548649 0.0729536 -0.003059 0.0729747 -0.086818 0.0077844 -0.0027082 0.0078775 0.1507398 0.1374575 0.1041567 -0.0033352 -0.0071307 0.002651 0.0029738 0.001156 0.0039548 0.1175683 0.0141283 -0.0279597 0.1017786 -0.0180352 0.0656654 -0.04292 0.1263411 0.0049007 -0.0283472 0.0131692 -0.0360077 -0.0995608 -0.0260828 0.0655595 0.0369379 -0.1279186 -0.0128971 -0.0335912 0.1109757 0.12445 0.0148217 0.1657239 0.2894194 -0.0571551 0.0628932 -0.0529899 0.3419722 unknown
polarizability: 143.4472094|4.4927049|132.9987334|0.0306449|-2.4511888|65.2924883 unknown
InChI: InChI=1S/C10H10O3/c1-6-4-3-5-7-8(6)9(11)13-10(7,2)12/h3-5,12H,1-2H3
charge 0 multiplicity 1
23 atoms
O  1.695979 -1.243572 0.026079
O  2.412457 0.710296 1.239592
O  -0.032133 -2.808343 0.115404
C  1.831441 0.262541 -0.004236
C  0.390679 0.746879 -0.046823
C  -0.488342 -0.359813 -0.010214
C  -1.896911 -0.200985 -0.027161
C  2.7031 0.600923 -1.218209
C  0.315044 -1.61539 0.057937
C  -0.08753 2.062188 -0.091215
C  -2.372859 1.137594 -0.083274
C  -1.493704 2.244814 -0.111912
C  -2.862153 -1.37011 0.01369
H  2.88324 1.688941 -1.260156
H  3.673781 0.078457 -1.1438
H  2.213854 0.281719 -2.152787
H  0.593132 2.918747 -0.094415
H  -3.455661 1.31058 -0.100458
H  -1.90715 3.258841 -0.145951
H  -2.331906 -2.333371 0.050278
H  -3.519392 -1.299841 0.900593
H  -3.519174 -1.364107 -0.876128
H  3.32981 0.339911 1.320264
