program: Gaussian 09
title: 000299185
version: EM64L-G09RevD.01
frameworkgroup: C1[X(C13H19NOS)]
method: RPBEPBE
basis: SDD
operation: Freq
keyword: #p
keyword: freq=noraman
keyword: PBEPBE/SDD
title: #p freq=noraman PBEPBE/SDD
converged: YES YES NO NO
title: Mulliken charges:
elementType: S O N C C C C C C C C C C C C C H H H H H H H H H H H H H H H H H H H
charge: 0.074903 -0.226915 -0.110843 0.329404 0.364366 -0.472291 0.362088 0.379267 -0.690859 -0.838459 -0.828362 -0.848680 -0.842452 0.035547 -0.608108 -0.617515 0.230689 0.243803 0.247450 0.239651 0.267730 0.241201 0.223851 0.229394 0.231099 0.231057 0.234936 0.227067 0.229400 0.225685 0.238398 0.262721 0.277929 0.226969 0.229878
chargesum: 0.00000
title: Mulliken charges with hydrogens summed into heavy atoms:
elementType: S O N C C C C C C C C C C C C C
charge: 0.074903 -0.226915 -0.110843 0.329404 0.364366 -0.472291 0.362088 0.379267 -0.460170 -0.107554 -0.095580 -0.157131 -0.151049 0.035547 0.118696 0.117262
polarizability: 2.33440352e+02 -1.90161841e+00 1.74703540e+02 -9.64586275e+00 1.58030941e+00 1.18757265e+02
1716.lowfreq: -6.8728 -2.0857 -0.0012 -0.0010 -0.0008 13.3354 27.5359 36.2527 49.3107
frequency: 27.4220 36.1808 49.2924 53.0934 83.8834 103.7864 107.6212 111.2914 121.7750 126.8240 173.5389 186.4042 199.7258 203.5063 231.1780 249.4803 292.8598 302.0703 339.1305 346.9072 351.3967 356.7557 399.9162 413.0892 434.3856 458.8875 510.0216 546.6629 559.4918 589.0938 607.9610 651.8750 668.9163 740.9118 804.8413 819.5612 879.6749 888.5599 985.9593 999.0982 1018.8406 1022.7490 1029.1191 1039.0663 1052.9545 1055.1717 1056.1750 1074.6243 1081.0051 1091.9983 1138.8719 1189.0323 1236.6404 1246.4759 1289.5698 1347.9880 1350.1818 1381.2393 1391.1698 1395.4588 1401.4654 1403.7743 1416.3120 1441.5976 1447.4130 1458.0657 1461.4824 1462.2975 1470.4867 1471.4713 1476.4618 1483.1084 1483.6823 1484.5210 1486.7355 1490.8520 1494.9729 1566.1812 1611.7260 1640.2204 2967.2448 2970.5104 2971.8049 2972.9843 2981.9423 2986.6834 3046.8702 3046.9845 3048.3398 3049.2687 3061.2568 3065.2129 3079.3471 3079.6937 3095.1888 3102.7338 3105.8434 3110.9776 3125.0640
redmass: 3.3647 3.3910 2.5807 1.4401 1.1135 2.4908 3.2279 1.1084 1.1271 3.0664 1.9675 1.0897 1.3240 3.5955 3.1941 5.0432 3.0815 3.1856 3.1857 3.2465 3.2255 2.5587 5.2146 4.1755 4.8713 5.6362 4.7618 2.7438 4.3591 3.2882 11.3422 5.9523 4.0274 3.2916 5.6807 3.2234 4.8852 1.3165 1.6554 1.3587 1.5041 1.4127 1.4703 2.1161 1.6146 1.6664 1.4007 1.9595 2.6329 1.2267 1.3800 4.6889 5.8079 1.3853 7.9811 3.2134 6.1557 2.5237 1.2493 1.4519 1.2404 1.2397 1.1562 1.1799 1.5877 1.2155 1.0835 1.0805 1.0451 1.0527 1.1740 1.0836 1.0511 1.1713 1.1915 1.1013 1.1256 5.1895 6.7954 8.6722 1.0367 1.0377 1.0375 1.0365 1.0387 1.0392 1.0967 1.1010 1.0975 1.1006 1.0959 1.0941 1.0982 1.0987 1.0991 1.0982 1.0971 1.0910 1.0975
irintensity: 2.0485 2.2607 1.1735 0.4840 0.0399 0.4309 0.9718 0.6480 0.1892 4.2902 2.8196 0.2536 0.4518 1.2744 4.7031 0.7423 2.4166 2.7025 8.4217 0.4072 18.7915 1.5487 2.3437 0.0981 0.2113 4.8388 3.1833 0.2073 1.7519 0.2916 6.0174 40.8170 0.2849 1.8580 10.7074 0.5188 36.3708 6.1951 31.2988 40.8831 19.4877 0.6994 17.0770 1.6493 1.2021 2.9051 28.6291 292.4346 0.9516 2.0532 1.5230 0.4192 49.5201 0.3019 0.4121 120.4852 3.7043 5.6830 1.9795 9.8024 28.9935 7.0887 35.6141 3.4824 6.1893 4.5549 34.7116 9.1411 11.1967 27.9272 8.5498 30.3403 24.7423 10.3485 10.9693 36.5348 14.9023 1.4905 2.2920 226.6361 33.9128 50.7134 51.9275 103.4774 23.6493 23.8831 16.7294 64.5181 26.6979 2.5082 12.8783 14.5405 9.5189 37.4445 13.3535 13.9604 24.0162 35.1551 2.2317
temp: 298.150 k
press: 1.00000 atm
elementType: 16 8 7 6 6 6 6 6 6 6 6 6 6 6 6 6 1 1 1 1 1 1 1 1 1 1 1 1 1 1 1 1 1 1 1
symmnumber: 1
zpe: 759761.1 jmol-1
zpe.correction: 0.289378 hartree
zpe.thermalcorrener: 0.308811 hartree
zpe.thermalcorrenthalpy: 0.309755 hartree
zpe.thermalcorrgfe: 0.240631 hartree
zpe.sumelectzpe: -1033.615318 hartree
zpe.sumelectthermal: -1033.595884 hartree
zpe.sumelectthermalent: -1033.594940 hartree
zpe.sumelectthermalfe: -1033.664065 hartree
dipole: 2.3645 -0.7602 -0.5805
dipole: 2.5506
quadrupole: -78.6568 -97.7451 -109.2278
quadrupole: -1.6163 -1.8734 -1.7211
quadrupole: 16.5531 -2.5352 -14.0179 -1.6163 -1.8734 -1.7211
hfenergy: -1033.9046955 hartree
pointgroup: C01 [X(C13H19N1O1S1)]
dipole: -0.9391263 -0.2049322 0.2881508 debye
polarizability: 232.9532209|-3.2602716|172.8440791|-12.0453673|-9.9363418|121.1038567 unknown
InChI: InChI=1S/C13H19NOS/c1-8-7-9(2)11(4)12(10(8)3)16-13(15)14(5)6/h7H,1-6H3
charge 0 multiplicity 1
35 atoms
S  -1.271026 -0.172774 1.243372
O  -1.705379 0.610763 -1.391814
N  -3.635939 0.103648 -0.171621
C  1.143287 -1.324264 0.387477
C  1.03134 1.178067 0.288503
C  0.450881 -0.090816 0.562496
C  2.490475 -1.273827 -0.075621
C  2.374381 1.20468 -0.193064
C  3.069605 -0.013828 -0.356774
C  0.466329 -2.654802 0.676722
C  0.257418 2.470707 0.458441
C  3.316812 -2.533655 -0.288985
C  3.064663 2.514383 -0.537556
C  -2.268745 0.239955 -0.33229
C  -4.301923 -0.333085 1.064845
C  -4.5193 0.487275 -1.290887
H  4.104214 0.01755 -0.722027
H  0.250249 -2.773498 1.755091
H  -0.50383 -2.725531 0.153534
H  1.090623 -3.505287 0.362006
H  -0.288458 2.709344 -0.474622
H  -0.494299 2.384417 1.260894
H  0.923415 3.318707 0.689455
H  3.407699 -3.132501 0.63677
H  2.873543 -3.192084 -1.060269
H  4.337207 -2.276119 -0.620672
H  2.495007 3.0904 -1.290611
H  3.177798 3.167566 0.349369
H  4.072919 2.329603 -0.946038
H  -5.141272 -1.004821 0.807092
H  -4.703707 0.526393 1.6366
H  -3.604758 -0.89082 1.709271
H  -3.897759 0.835614 -2.128787
H  -5.204783 1.299367 -0.981093
H  -5.121489 -0.38063 -1.620508
