program: Gaussian 09
title: 000299254
version: EM64L-G09RevD.01
frameworkgroup: C1[X(C22H20O2)]
method: RPBEPBE
basis: SDD
operation: Freq
keyword: #pfreq=noraman
keyword: PBEPBE/SDD
title: #p freq=noraman PBEPBE/SDD
converged: YES YES NO NO
title: Mulliken charges:
elementType: O O C C C C C C C C C C C C C C C C C C C C C C H H H H H H H H H H H H H H H H H H H H
charge: -0.301761 -0.304693 0.118344 0.154886 0.018761 0.021989 0.155275 0.268948 0.283395 -0.002627 0.319677 -0.120065 -0.871012 -0.790145 -0.370606 -0.403901 -0.409217 -0.438060 -0.271158 -0.271077 -0.268407 -0.248031 -0.531361 -0.529188 0.275333 0.225152 0.235459 0.214821 0.236962 0.245515 0.268196 0.247777 0.232030 0.280092 0.226725 0.226379 0.226801 0.230514 0.215343 0.227813 0.266647 0.228046 0.252907 0.227518
chargesum: 0.00000
title: Mulliken charges with hydrogens summed into heavy atoms:
elementType: O O C C C C C C C C C C C C C C C C C C C C C C
charge: -0.301761 -0.304693 0.118344 0.154886 0.018761 0.021989 0.155275 0.268948 0.283395 -0.002627 0.319677 -0.120065 -0.135068 -0.092848 -0.102409 -0.156124 -0.177187 -0.157967 -0.044433 -0.044698 -0.041606 -0.017517 0.178443 0.179283
polarizability: 4.22636408e+02 2.84165860e+01 2.96916326e+02 -5.30063880e+00 3.14758022e+00 1.27119480e+02
1716.lowfreq: -7.9267 -2.6587 -0.0009 -0.0008 -0.0006 2.7058 40.7985 48.2595 65.8127
frequency: 40.7007 48.2421 65.7804 88.1455 108.0990 112.0304 118.1176 131.4412 139.5215 157.4111 166.7060 174.0195 201.3883 223.4752 253.1536 272.5666 279.9495 299.9243 314.3989 328.6504 347.6456 367.4857 379.1954 400.4281 431.8827 434.6437 461.5197 469.5588 485.4340 492.8361 511.3183 552.0551 566.1443 586.7886 605.8388 631.6398 645.7276 675.0448 689.1523 718.6698 729.7153 761.7466 772.2513 788.3825 796.4064 798.0166 833.8222 871.2218 878.2609 889.5482 912.1315 936.9136 957.6351 967.9794 986.2625 989.4734 995.0008 1018.9764 1032.4029 1034.2362 1035.7618 1047.8141 1059.1650 1069.8467 1075.9532 1112.7705 1113.2487 1125.0210 1137.6780 1153.0220 1154.7952 1161.4717 1175.3744 1183.0538 1235.5157 1263.8830 1294.4818 1310.4016 1318.2760 1347.9709 1365.8828 1373.4785 1392.7220 1396.3728 1399.5610 1415.9880 1429.5309 1431.3297 1439.1067 1439.6029 1451.7253 1456.5742 1459.2588 1468.2176 1477.7928 1480.3293 1488.4522 1491.3710 1497.5466 1511.0998 1539.3754 1554.1676 1566.3547 1584.3231 1608.3153 1619.4560 2970.3439 2971.7101 2974.8900 2997.7754 3048.3765 3071.3252 3072.8629 3076.1287 3106.8545 3118.3244 3120.3708 3127.2759 3129.2561 3135.3312 3144.9677 3148.6958 3165.2927 3168.9416 3173.6387 3182.7362
redmass: 3.2865 4.2459 3.9803 3.1605 2.1993 1.5672 2.8896 1.1660 2.8517 2.6313 1.1229 3.7502 3.9421 3.9954 4.5054 1.4906 3.7442 5.1840 6.1432 5.9453 4.2609 3.7592 2.7010 3.2968 3.7283 3.2288 4.2527 4.7278 4.8703 4.1225 5.6308 3.6043 4.1144 5.5293 3.9837 4.1925 6.1951 6.0226 4.6509 5.3794 5.0150 1.3574 1.7052 2.3035 3.8715 4.9978 4.8471 1.7837 5.1791 1.4296 5.9583 4.0985 1.3609 1.3897 1.3514 2.0609 1.7452 3.3972 3.2343 1.5578 1.5460 2.0210 2.2756 3.2560 2.2961 1.2696 1.2393 1.9779 3.8712 1.4007 1.4127 1.7895 1.1399 1.0988 1.6784 1.7197 4.1591 2.2965 4.0275 3.2593 4.5964 4.3430 3.2035 1.2825 1.3955 1.2948 2.2075 5.4015 1.7241 1.6228 1.1023 1.0899 1.0608 1.7431 1.0673 1.1945 1.9523 1.1041 1.0783 1.5647 6.1272 5.3042 7.6776 8.6449 6.1972 5.9293 1.0330 1.0426 1.0301 1.0423 1.0941 1.1015 1.1024 1.0961 1.0958 1.1031 1.1040 1.0855 1.0859 1.0932 1.0901 1.0917 1.0932 1.0957 1.0974 1.0946
irintensity: 0.4517 0.0668 0.7602 3.7177 0.5420 0.4465 2.2200 0.9491 0.8989 2.3979 0.2781 4.5510 1.2560 2.6267 5.0466 1.7128 4.3525 3.6231 4.2458 2.1355 3.0943 1.8200 1.2169 0.9900 2.6076 1.6212 3.8710 0.3937 2.8081 11.9307 1.6307 3.6212 1.3398 9.0020 1.3946 5.0096 4.0515 3.7002 15.3731 3.1078 6.0522 85.7614 51.5272 21.9839 1.7763 8.8055 5.6251 0.1993 17.8867 2.1694 16.5233 33.8957 0.7716 7.6894 1.8868 38.4591 26.7202 63.8311 10.5690 3.6412 1.8045 16.5041 1.5105 25.1750 30.2293 18.0047 4.4743 24.2447 17.1647 6.1117 3.7817 29.4851 2.2539 0.6559 16.7445 2.5460 61.3501 20.9217 27.2875 5.5933 24.7281 19.9948 0.3600 18.6461 4.2373 0.0870 11.0041 0.0436 5.2888 16.4963 19.2344 4.1394 5.2779 9.2425 20.7057 3.3992 15.2844 16.2145 31.8194 19.1850 20.9809 0.7117 5.2294 35.0611 2.0249 5.8607 95.8904 30.7632 64.7785 31.4424 20.7371 23.9876 32.0014 19.8757 9.9957 27.4110 15.7951 3.1718 3.9297 16.7870 13.7763 23.0014 26.9554 19.0210 39.3926 16.5350
temp: 298.150 k
press: 1.00000 atm
elementType: 8 8 6 6 6 6 6 6 6 6 6 6 6 6 6 6 6 6 6 6 6 6 6 6 1 1 1 1 1 1 1 1 1 1 1 1 1 1 1 1 1 1 1 1
symmnumber: 1
zpe: 930369.6 jmol-1
zpe.correction: 0.354359 hartree
zpe.thermalcorrener: 0.375551 hartree
zpe.thermalcorrenthalpy: 0.376495 hartree
zpe.thermalcorrgfe: 0.305560 hartree
zpe.sumelectzpe: -999.087166 hartree
zpe.sumelectthermal: -999.065974 hartree
zpe.sumelectthermalent: -999.065030 hartree
zpe.sumelectthermalfe: -999.135965 hartree
dipole: 0.3782 -0.6341 0.3933
dipole: 0.8365
quadrupole: -128.0456 -121.8933 -142.2209
quadrupole: -4.5107 2.9656 1.7829
quadrupole: 2.6744 8.8266 -11.5010 -4.5107 2.9656 1.7829
hfenergy: -999.4415252 hartree
pointgroup: C01 [X(C22H20O2)]
dipole: 0.138185 -0.2522499 0.159977 debye
polarizability: 424.9690382|21.8001596|294.4436981|-9.6311995|-1.4915149|127.2594765 unknown
InChI: InChI=1S/C22H20O2/c1-13-15-9-5-6-10-16(15)14(2)20-19(13)17-11-7-8-12-18(17)21(23-3)22(20)24-4/h5-12H,1-4H3
charge 0 multiplicity 1
44 atoms
O  1.021055 -2.877034 0.200908
O  3.51463 -1.54992 0.401812
C  -0.062516 0.735856 -0.05718
C  -0.153251 -0.726703 -0.163531
C  -1.229103 1.485004 0.255535
C  -1.421484 -1.359939 -0.313275
C  1.254424 1.364641 -0.294985
C  -2.512129 0.835924 0.217062
C  -2.613101 -0.572029 -0.133466
C  1.099014 -1.480285 -0.012865
C  2.451937 0.580845 -0.160035
C  2.325487 -0.837258 0.1056
C  -1.172957 2.925008 0.75423
C  -1.56712 -2.827295 -0.696637
C  1.410738 2.713333 -0.738867
C  -3.724755 1.57071 0.467733
C  -3.928638 -1.156341 -0.211111
C  3.735975 1.175528 -0.324759
C  -4.979487 0.97086 0.378643
C  -5.081223 -0.413738 0.039016
C  2.680135 3.285926 -0.933554
C  3.853581 2.5242 -0.692148
C  1.821344 -3.721339 -0.717057
C  3.572599 -2.069422 1.789013
H  -0.159308 3.204488 1.075596
H  -1.505938 3.663762 -0.001376
H  -1.835664 3.039894 1.630673
H  -2.480038 -2.981609 -1.295659
H  -0.720977 -3.170471 -1.305084
H  -1.62002 -3.488487 0.187603
H  0.527279 3.304963 -0.986786
H  -3.6661 2.634493 0.712771
H  -4.034691 -2.217487 -0.449399
H  4.618644 0.54402 -0.190789
H  -5.885965 1.557152 0.56553
H  -6.065553 -0.89112 -0.021436
H  2.759416 4.319533 -1.287981
H  4.842366 2.975555 -0.828658
H  1.461019 -3.602741 -1.757279
H  1.654131 -4.755133 -0.377559
H  2.891182 -3.457688 -0.663221
H  4.538161 -2.592384 1.867916
H  2.736825 -2.766703 1.979756
H  3.536878 -1.231268 2.5098
