program: Gaussian 09
title: 000299217
version: EM64L-G09RevD.01
frameworkgroup: C1[X(C19H19N5O4)]
method: RPBEPBE
basis: SDD
operation: Freq
keyword: #p
keyword: freq=noraman
keyword: PBEPBE/SDD
title: #p freq=noraman PBEPBE/SDD
converged: YES YES NO NO
title: Mulliken charges:
elementType: O O O O N N N N N C C C C C C C C C C C C C C C C C C C H H H H H H H H H H H H H H H H H H H
charge: -0.178192 -0.270882 -0.207884 -0.202397 -0.022301 -0.424510 -0.006683 0.026372 0.016983 0.160703 -0.433852 -0.022192 -0.707725 -0.727755 -0.426758 0.388101 -0.405986 -0.383810 -0.164460 -0.234579 -0.229608 0.299572 -0.233577 0.261110 -0.287990 -0.497046 -0.369697 0.448762 0.247369 0.236665 0.232902 0.221940 0.231752 0.227872 0.218221 0.233458 0.257621 0.258662 0.237411 0.238678 0.352704 0.234344 0.234266 0.236710 0.305039 0.336423 0.294241
chargesum: 0.00000
title: Mulliken charges with hydrogens summed into heavy atoms:
elementType: O O O O N N N N N C C C C C C C C C C C C C C C C C C C
charge: -0.178192 -0.270882 -0.207884 -0.202397 -0.022301 -0.071805 -0.006683 0.026372 0.016983 0.160703 0.050183 -0.022192 -0.021130 -0.048204 0.089525 0.388101 -0.168575 -0.145132 -0.164460 -0.000235 0.004657 0.299572 0.003133 0.261110 0.017048 -0.160623 -0.075456 0.448762
polarizability: 4.49034250e+02 2.30649488e+01 2.87778032e+02 2.10555412e+01 -3.15140203e+01 1.84714252e+02
1716.lowfreq: -9.8504 -4.8590 -2.2340 -0.0005 0.0007 0.0008 13.2190 17.6870 29.9369
frequency: 13.1606 17.5851 29.9055 36.1682 47.7138 50.7756 55.5778 63.5942 76.1170 90.4573 119.4929 131.2118 144.8252 161.4692 167.1216 174.6576 182.1011 199.4676 212.7385 243.9677 266.5264 292.6210 307.4492 312.9326 326.4136 359.3365 366.0241 380.4354 386.5709 392.3920 405.2997 417.7497 441.6839 443.4712 459.1976 501.2305 503.8988 516.6795 558.7419 593.3233 611.9602 617.4821 651.7595 652.1659 678.0972 687.1641 700.8298 706.7005 711.0399 725.3138 744.1246 754.0675 776.9558 797.1372 820.6791 853.9564 865.6894 867.7309 888.0506 915.6027 924.5628 936.2051 940.1260 957.9399 963.6074 977.6815 989.0294 995.0472 998.7850 1013.0594 1019.6297 1030.3531 1033.5268 1045.4134 1055.4777 1084.4727 1099.7428 1133.5681 1135.9408 1160.3125 1162.8940 1175.0754 1183.5918 1192.2429 1210.9042 1223.1429 1233.5121 1264.8035 1284.1414 1292.2814 1305.0550 1314.9440 1338.5764 1345.5518 1360.5473 1371.2180 1383.6521 1391.5264 1409.1576 1429.2506 1445.6249 1449.5311 1461.8392 1464.3363 1470.1701 1477.6663 1483.0489 1488.9610 1497.5201 1507.0571 1530.0723 1579.7223 1582.6948 1607.1070 1621.4309 2201.0283 2984.6486 2993.0623 2995.4690 3013.1434 3044.7365 3072.3700 3078.5701 3086.4322 3087.6423 3107.1225 3127.3932 3131.4613 3143.8921 3152.8822 3168.8764 3180.1759 3188.7346 3200.7022 3271.9882
redmass: 7.3133 6.9476 7.1994 4.8945 4.0435 4.9255 6.9580 5.8272 10.2417 4.9639 5.2108 4.9934 5.7623 5.6102 2.1380 1.6533 5.6636 5.4846 4.3398 2.0960 1.6196 2.4885 7.2714 6.3925 3.4492 6.7350 4.0689 4.1243 5.2953 6.0723 2.9021 5.4209 2.8707 3.7934 4.2471 7.6288 5.1618 3.6281 3.9793 4.0638 6.3753 7.6119 6.7963 7.7912 8.9688 5.2028 3.4262 7.5609 2.0091 4.1053 1.3213 10.9294 2.2301 1.5431 2.3891 1.2509 1.7094 2.5294 5.4280 2.2963 1.4354 3.2307 1.6082 3.7068 1.4112 1.4054 5.8466 1.6930 1.3259 1.3174 1.5164 2.2121 3.4786 2.8863 2.2467 1.6378 3.7625 1.8588 1.3739 2.1209 8.2490 1.0553 2.3888 1.1485 4.7970 1.8011 1.7229 2.2974 1.6621 1.5585 1.4662 1.3801 5.0838 1.3644 6.7736 6.8817 5.4300 1.1838 1.1942 2.2283 5.4212 1.0978 1.0760 1.6249 1.1685 2.1852 1.1245 1.3880 1.3048 2.0548 7.2037 5.4403 5.9870 6.1002 7.3349 12.4342 1.0357 1.0558 1.0404 1.0611 1.0995 1.1025 1.0997 1.0997 1.0991 1.0976 1.0854 1.0874 1.0921 1.0965 1.1017 1.0897 1.0920 1.0960 1.0783
irintensity: 0.4247 0.4497 1.3170 0.3410 4.7039 0.5971 0.9328 0.5575 0.5479 3.5028 3.8047 1.5085 0.8009 2.1405 3.3416 1.6667 1.3041 1.9970 0.5308 1.2905 1.0574 1.1675 0.3143 0.6640 1.5329 0.8303 0.1703 2.1794 0.8537 1.1730 2.6092 16.9031 1.6875 4.5075 1.5574 6.6283 3.2413 11.8847 9.3063 6.8111 0.1038 7.1580 10.9802 14.9457 5.3085 5.6795 12.9698 9.5448 40.9423 0.3113 29.9795 20.8170 35.1880 60.5072 32.1410 1.3893 15.8862 12.2641 8.7496 3.0466 5.4984 1.0727 2.7178 12.7475 23.4890 1.0424 7.7455 3.6586 0.7473 0.0314 11.1707 1.1861 54.2950 2.5991 57.8857 9.9983 78.5757 15.1315 45.6659 25.6797 328.8691 0.5068 22.5403 8.2997 456.1302 41.9192 106.6839 27.0297 15.9029 48.9807 13.1365 0.9294 312.7986 1.7667 68.5914 0.2064 36.8093 18.3451 19.5777 8.7141 0.4528 5.2883 0.5440 17.9569 6.8207 25.3611 16.7223 39.6440 89.5497 117.0022 3.3843 138.9226 12.2678 2.6234 434.8901 12.7062 19.7766 5.6159 24.5820 15.7167 0.2450 16.7974 17.6797 30.1765 40.1181 25.7920 4.2733 1.0087 12.5153 31.8382 25.7640 3.6089 22.0653 0.1204 74.7879
temp: 298.150 k
press: 1.00000 atm
elementType: 8 8 8 8 7 7 7 7 7 6 6 6 6 6 6 6 6 6 6 6 6 6 6 6 6 6 6 6 1 1 1 1 1 1 1 1 1 1 1 1 1 1 1 1 1 1 1
symmnumber: 1
zpe: 931533.6 jmol-1
zpe.correction: 0.354802 hartree
zpe.thermalcorrener: 0.381214 hartree
zpe.thermalcorrenthalpy: 0.382158 hartree
zpe.thermalcorrgfe: 0.294850 hartree
zpe.sumelectzpe: -1307.852414 hartree
zpe.sumelectthermal: -1307.826002 hartree
zpe.sumelectthermalent: -1307.825058 hartree
zpe.sumelectthermalfe: -1307.912367 hartree
dipole: -9.8613 -3.7041 -2.7965
dipole: 10.8989
quadrupole: -188.2866 -185.4270 -170.4935
quadrupole: 9.2445 4.5597 -13.1845
quadrupole: -6.8842 -4.0247 10.9089 9.2445 4.5597 -13.1845
hfenergy: -1308.2072163 hartree
pointgroup: C01 [X(C19H19N5O4)]
dipole: -4.0269775 -0.9501159 1.1257835 debye
polarizability: 452.4376494|14.3412527|192.426741|-6.0546272|43.2998352|276.6621436 unknown
InChI: InChI=1S/C19H19N5O4/c1-19(2,11-6-12-20)18(14-7-4-3-5-8-14)22-21-16-10-9-15(23(25)26)13-17(16)24(27)28/h3-5,7-10,13,21H,6,11H2,1-2H3
charge 0 multiplicity 1
47 atoms
O  3.938248 -1.407352 -2.224405
O  1.662805 -1.419613 -2.290104
O  5.285679 1.175697 3.334765
O  6.388459 0.325754 1.52205
N  -0.872245 -0.168744 0.40482
N  0.289074 -0.440028 -0.305789
N  -0.759578 3.01158 -4.389168
N  2.801795 -1.140492 -1.687777
N  5.308223 0.632431 2.160671
C  -2.389543 -0.853891 -1.579896
C  -1.664332 0.045124 -2.653552
C  -2.068454 -0.371228 -0.130948
C  -1.93702 -2.336929 -1.774419
C  -3.914591 -0.78129 -1.882468
C  -1.831437 1.573055 -2.41743
C  -3.165937 -0.031279 0.839316
C  -4.133324 -0.990558 1.241513
C  -3.205028 1.263345 1.422559
C  -1.239642 2.371159 -3.504224
C  -5.120902 -0.657456 2.193471
C  -4.201428 1.600355 2.364015
C  1.509877 -0.191753 0.290632
C  -5.165649 0.641525 2.751232
C  2.755559 -0.513049 -0.367749
C  1.580861 0.402067 1.593184
C  3.997792 -0.239521 0.246674
C  2.805437 0.668314 2.199447
C  4.012236 0.347106 1.516104
H  -0.588409 -0.185676 -2.741299
H  -2.101064 -0.216666 -3.635004
H  -0.853825 -2.493368 -1.631138
H  -2.469385 -3.001872 -1.071026
H  -2.181717 -2.663966 -2.801798
H  -4.340587 0.215038 -1.672427
H  -4.077831 -1.012411 -2.950814
H  -4.491327 -1.510962 -1.292947
H  -1.350861 1.868378 -1.465157
H  -2.902034 1.839559 -2.334766
H  -4.091866 -2.011901 0.847177
H  -2.44647 2.000122 1.136073
H  0.338328 -0.891449 -1.237545
H  -5.849708 -1.413619 2.504888
H  -4.222494 2.60625 2.797391
H  -5.936987 0.899969 3.484732
H  0.63666 0.629934 2.090588
H  4.929126 -0.48794 -0.268568
H  2.863713 1.119648 3.193312
