program: Gaussian 09
title: 000299146
version: EM64L-G09RevD.01
frameworkgroup: C1[X(C5H8N2O3)]
method: RPBEPBE
basis: SDD
operation: Freq
keyword: #pfreq=noraman
keyword: PBEPBE/SDD
title: #p freq=noraman PBEPBE/SDD
converged: NO YES NO NO
title: Mulliken charges:
elementType: O O O N N C C C C C H H H H H H H H
charge: -0.240076 -0.169578 -0.222141 -0.192217 0.111804 0.322862 -0.460854 -0.691068 -0.690841 0.278526 0.276727 0.276744 0.217280 0.246347 0.236402 0.236388 0.246410 0.217286
chargesum: 0.00000
title: Mulliken charges with hydrogens summed into heavy atoms:
elementType: O O O N N C C C C C
charge: -0.240076 -0.169578 -0.222141 -0.192217 0.111804 0.322862 0.092617 0.008961 0.009243 0.278526
polarizability: 9.89353801e+01 -1.05218221e+00 8.41465711e+01 2.65996908e-02 1.33535605e-02 5.48045732e+01
1716.lowfreq: -37.9671 -2.5077 -0.0009 -0.0001 -0.0001 10.1901 15.1268 93.3773 172.2067
frequency: -37.6785 93.3464 172.2047 179.9670 199.9937 242.5897 307.5911 308.0334 318.1141 358.4456 416.1777 440.1426 544.4929 583.4389 631.8289 678.2999 770.2747 817.8476 872.0176 918.5376 951.1478 969.9616 1006.2805 1010.3606 1061.9740 1149.8695 1151.0499 1185.5554 1249.2948 1272.9134 1319.7028 1359.6933 1385.1270 1401.6242 1451.0114 1463.6627 1470.8949 1475.9757 1488.3874 1726.9885 2992.3904 2995.7438 3014.0695 3071.1900 3089.8495 3095.1197 3106.0335 3110.6829
redmass: 3.2888 5.4329 5.3625 5.7143 1.1267 1.1183 2.7306 3.1981 4.8744 4.0919 3.5023 2.8671 4.7478 7.2154 7.1818 11.8852 7.1337 5.5968 3.4363 1.6158 1.2705 1.8569 7.7659 1.3700 6.8239 2.1809 1.2932 5.4125 3.0463 2.6412 1.9890 6.3088 1.2366 1.2087 1.0499 1.0474 1.0647 1.0654 1.0617 12.9199 1.0359 1.0365 1.0585 1.1061 1.0997 1.0996 1.1011 1.1002
irintensity: 1.2358 0.8489 0.7498 3.5902 0.3979 0.4511 0.6398 1.0910 3.0236 3.2162 3.5282 1.6359 5.6806 15.3275 20.6676 15.7655 21.2411 73.4099 39.2332 0.1792 1.4355 20.8102 140.8793 0.1597 467.9822 31.6352 2.1613 5.6979 112.9536 19.3904 24.0472 43.9374 30.3649 15.6991 2.2819 4.5721 9.1970 22.8478 4.5698 433.9178 10.7766 8.4835 6.5879 7.9139 8.6877 29.2849 6.1050 27.8050
temp: 298.150 k
press: 1.00000 atm
elementType: 8 8 8 7 7 6 6 6 6 6 1 1 1 1 1 1 1 1
symmnumber: 1
zpe: 352180.0 jmol-1
zpe.correction: 0.134138 hartree
zpe.thermalcorrener: 0.143345 hartree
zpe.thermalcorrenthalpy: 0.144290 hartree
zpe.thermalcorrgfe: 0.100144 hartree
zpe.sumelectzpe: -529.669680 hartree
zpe.sumelectthermal: -529.660473 hartree
zpe.sumelectthermalent: -529.659529 hartree
zpe.sumelectthermalfe: -529.703675 hartree
dipole: -5.3808 -3.8422 -0.0059
dipole: 6.6118
quadrupole: -65.4006 -68.6027 -54.4290
quadrupole: 3.0228 -0.0096 0.0007
quadrupole: -2.5898 -5.7920 8.3818 3.0228 -0.0096 0.0007
hfenergy: -529.8038187 hartree
pointgroup: C01 [X(C5H8N2O3)]
dipole: -2.0377579 -1.6048316 -0.196538 debye
dipolederiv: -1.34571 -0.4088499 -0.0983816 -0.2873934 -0.6730832 -0.0255687 -0.1002242 -0.0384327 -0.3670473 -0.6371507 -0.3431907 -0.0306592 -0.2352157 -1.0978558 -0.0142857 -0.0323102 -0.0265304 -0.3035925 -0.5080939 0.0640988 -0.0367788 0.9003812 -0.6817604 0.1024863 -0.0462708 0.012465 -0.1784012 -1.1705677 0.6732406 -0.1213404 0.5050347 -0.799868 0.0616329 -0.1190175 0.0808536 -0.1240398 1.3019535 -0.6273967 0.1497385 -0.8901668 0.4994046 -0.1015328 0.1529057 -0.073252 -0.0041205 0.5841472 0.1594226 0.0092153 0.4070655 0.5199363 0.0413067 0.0060665 0.0155157 0.4781133 -0.0975022 0.1182026 -0.0365432 -0.0597555 0.1291364 -0.0045069 -0.0357153 0.0144817 0.233832 -0.0301671 -0.0167195 -0.0411392 -0.0564515 0.0107907 -0.0028162 -0.0504214 -0.0393917 -0.1263428 -0.0521187 -0.0224282 0.0568154 -0.0537986 0.011495 -0.012026 0.0669623 0.0319679 -0.1056664 1.7936281 0.3775359 0.1501496 -0.1958081 1.9740231 -0.0422515 0.1579377 0.0186418 0.3247072 0.0484483 -0.0017311 -0.0268041 -0.0372319 0.0259489 0.0487407 -0.0017141 0.0781004 -0.0309384 0.0383742 0.0150478 0.0411521 -0.0260497 0.0234649 -0.0564152 0.0173465 -0.0780015 -0.0202868 0.0696275 -0.0518684 -0.0160529 -0.0868607 -0.1081055 -0.014395 -0.0275407 0.0172655 0.0819623 -0.0408149 0.0892958 -0.0352153 0.1200262 0.0426024 0.0146746 -0.0066192 -0.0187057 0.0868901 -0.0046826 -0.0311467 0.1145778 -0.020065 0.0953246 0.0276668 0.0849156 0.0137808 -0.0442367 0.0328841 -0.0300944 -0.0981178 -0.0157541 0.0939205 -0.0352479 -0.0688411 -0.0239206 -0.0804956 -0.0431865 0.0842171 0.0063598 0.1201428 0.0430878 0.0110267 -0.0230557 0.0374104 0.0888595 0.0609314 -0.0476355 0.0130238 -0.0880993 -0.1084624 0.0015114 0.025596 -0.0222484 0.0908037 unknown
polarizability: 98.5054101|-0.3448571|84.0774315|4.6483611|-0.4074529|55.3036828 unknown
InChI: InChI=1S/C5H8N2O3/c1-5(2)3-7(6-9)4(8)10-5/h3H2,1-2H3
charge 0 multiplicity 1
18 atoms
O  -1.030733 1.095905 -0.07877
O  0.941938 2.343908 0.113292
O  2.625599 -1.468929 0.341394
N  0.916802 -0.059855 0.140854
N  2.298325 -0.233139 0.292158
C  -1.428131 -0.379616 -0.101131
C  -0.073415 -1.149258 0.046201
C  -2.108264 -0.624959 -1.454121
C  -2.366848 -0.592667 1.093426
C  0.350729 1.262804 0.064328
H  -0.036047 -1.778168 0.95278
H  0.149467 -1.792233 -0.823163
H  -2.441154 -1.676422 -1.52508
H  -2.988434 0.030283 -1.562232
H  -1.416512 -0.418401 -2.288919
H  -1.855951 -0.363861 2.044642
H  -3.248593 0.063587 1.006433
H  -2.710777 -1.642578 1.122809
