program: Gaussian 09
title: 000299168
version: EM64L-G09RevD.01
frameworkgroup: C1[X(C16H24N2O2)]
method: RPBEPBE
basis: SDD
operation: Freq
keyword: #p
keyword: freq=noraman
keyword: PBEPBE/SDD
title: #p freq=noraman PBEPBE/SDD
converged: YES YES NO NO
title: Mulliken charges:
elementType: O O N N C C C C C C C C C C C C C C C C H H H H H H H H H H H H H H H H H H H H H H H H
charge: -0.304253 -0.275958 -0.100909 -0.685320 0.460758 -0.504787 -0.516236 -0.456153 -0.462991 -0.477685 -0.402449 -0.637233 -0.641844 0.187714 0.230729 -0.339046 -0.326827 -0.406940 -0.401310 0.500401 0.241472 0.191657 0.196454 0.227997 0.198273 0.264053 0.225553 0.207201 0.228551 0.200348 0.243217 0.253400 0.188287 0.242575 0.217259 0.220292 0.240638 0.189732 0.265682 0.257981 0.220671 0.218527 0.309953 0.310570
chargesum: 0.00000
title: Mulliken charges with hydrogens summed into heavy atoms:
elementType: O O N N C C C C C C C C C C C C C C C C
charge: -0.304253 -0.275958 -0.100909 -0.064797 0.460758 -0.071658 -0.091785 0.006173 -0.030237 -0.048787 0.094167 0.010887 0.008817 0.187714 0.230729 -0.073364 -0.068845 -0.186269 -0.182784 0.500401
polarizability: 2.79901522e+02 1.40253004e+01 2.02567312e+02 1.82542730e+01 7.67111383e+00 1.26066586e+02
1716.lowfreq: -20.2865 -7.5903 -5.3362 0.0002 0.0007 0.0007 17.1464 28.9029 32.9838
frequency: 14.3214 28.7823 32.9530 39.7601 65.5222 73.8213 78.3801 104.0386 115.1303 127.7973 177.6131 201.4417 210.0913 227.0775 234.5387 270.2266 288.5338 295.6175 311.5478 349.2775 361.0389 380.1290 403.2453 408.9111 414.4306 417.4407 444.6927 453.2551 505.5156 532.4415 600.6711 616.4429 633.7199 645.8203 672.4420 735.1122 751.1895 752.7671 798.7245 803.2426 820.4312 822.4000 822.8037 842.3262 873.0914 887.0412 901.7969 924.0742 943.7175 970.1683 971.4417 982.3222 996.5870 1016.2606 1028.1404 1035.1802 1037.4394 1040.8437 1052.7163 1061.5172 1090.7777 1113.8685 1128.6489 1131.5278 1135.4624 1170.7679 1177.4000 1190.4420 1210.4782 1226.9561 1252.5907 1254.5685 1267.3635 1269.4373 1275.7176 1295.2805 1305.8344 1306.4143 1323.8492 1324.7386 1333.6068 1357.6135 1363.3448 1391.3064 1420.2484 1435.4336 1444.0027 1446.5741 1463.9131 1464.5540 1466.7448 1472.8454 1475.3455 1477.0704 1479.9371 1486.3426 1493.1805 1516.4167 1569.6368 1608.2788 1631.2778 1645.7448 2842.4725 2854.3539 2911.1581 2972.1217 2978.6105 2998.2674 3012.2086 3014.5502 3016.5685 3019.1126 3026.2738 3037.6318 3051.6126 3056.6445 3074.0633 3079.3439 3084.2404 3100.7139 3122.8302 3125.6947 3159.2034 3171.9807 3561.4313 3701.2844
redmass: 4.4615 3.6668 3.7765 2.9826 2.0310 3.1206 4.6996 5.4158 4.1951 2.7766 2.5465 1.3334 2.2635 3.0459 1.1935 4.5468 4.0568 3.5154 2.9560 2.4284 3.8266 2.7186 1.1316 1.1851 2.4844 2.0846 2.3670 2.6331 2.8945 4.2611 4.0451 3.0112 6.8619 3.2108 4.0578 2.2844 3.8285 3.6319 1.9945 2.7409 2.0757 4.5199 1.3306 1.8381 2.6152 2.2211 3.3375 2.6339 2.0851 1.4220 1.9332 1.3521 3.3023 1.4950 1.8973 1.6626 1.6505 1.6173 3.4580 2.5868 1.2514 2.0042 1.2221 1.9554 1.3814 1.5517 1.1417 1.4766 1.7729 1.3157 2.1339 2.2383 1.3980 2.0313 1.3529 1.5177 1.3320 1.3189 2.1819 1.9326 1.4970 1.3255 1.3938 4.8024 1.1383 1.1261 1.1075 4.1007 1.0808 1.0698 1.0863 1.0623 1.0769 1.0664 1.0696 1.0576 1.0994 3.1602 7.2293 8.9515 3.2639 1.4314 1.0574 1.0573 1.0675 1.0647 1.0627 1.0604 1.0727 1.0646 1.0808 1.0846 1.0568 1.0986 1.0974 1.1026 1.1003 1.1048 1.0989 1.1084 1.0895 1.0892 1.0952 1.0947 1.0450 1.1040
irintensity: 1.6902 0.6462 0.1849 0.8543 0.5079 0.7818 1.1846 1.0767 0.9706 0.4241 0.4749 1.1699 1.2030 0.8599 0.2294 3.0623 1.9202 14.9402 0.6085 16.1995 2.4546 21.3067 148.0453 163.7598 2.4921 1.0045 2.4392 0.4699 3.1259 5.4132 11.6029 2.5294 2.5080 3.0395 25.1858 6.0549 10.1276 26.7726 4.1162 8.2270 8.4138 1.2431 1.2741 69.7826 2.5316 5.3662 8.1782 52.2638 4.2425 0.8572 12.1951 0.2342 48.5874 19.9535 41.2601 5.7249 48.7086 103.5026 237.0661 9.7328 5.9198 10.3821 15.3915 3.8255 3.5196 2.6957 192.3964 1.8161 3.0083 1.6087 139.8366 194.7983 12.3401 4.3179 9.7288 3.2804 5.9682 2.6184 62.0102 56.9869 7.6997 6.8569 28.8687 11.1040 3.2028 8.2341 28.6310 4.6664 9.7914 2.3967 11.4912 5.4090 2.6969 27.3273 12.6253 13.6200 18.2286 62.6567 33.3545 309.1595 106.1974 336.0317 79.5763 221.0639 73.6901 26.4264 62.5527 37.8071 33.1748 58.4492 63.5842 14.8679 19.7729 29.7703 14.2594 16.8000 35.7855 85.8353 41.4033 4.5406 15.2380 23.8635 9.5545 4.3314 112.7536 22.7624
temp: 298.150 k
press: 1.00000 atm
elementType: 8 8 7 7 6 6 6 6 6 6 6 6 6 6 6 6 6 6 6 6 1 1 1 1 1 1 1 1 1 1 1 1 1 1 1 1 1 1 1 1 1 1 1 1
symmnumber: 1
zpe: 983784.5 jmol-1
zpe.correction: 0.374704 hartree
zpe.thermalcorrener: 0.395710 hartree
zpe.thermalcorrenthalpy: 0.396654 hartree
zpe.thermalcorrgfe: 0.322656 hartree
zpe.sumelectzpe: -882.513885 hartree
zpe.sumelectthermal: -882.492879 hartree
zpe.sumelectthermalent: -882.491935 hartree
zpe.sumelectthermalfe: -882.565932 hartree
dipole: 3.0506 3.2943 1.8030
dipole: 4.8384
quadrupole: -78.0717 -118.6520 -125.0015
quadrupole: 5.5960 4.8366 -0.2343
quadrupole: 29.1700 -11.4103 -17.7597 5.5960 4.8366 -0.2343
hfenergy: -882.8885885 hartree
pointgroup: C01 [X(C16H24N2O2)]
dipole: 1.2021734 -1.2362714 -0.8061958 debye
polarizability: 278.7138802|-10.7600996|201.2443625|-25.416265|10.3044983|128.5771767 unknown
InChI: InChI=1S/C16H24N2O2/c1-18(2)11-16(9-3-4-10-16)12-20-15(19)13-5-7-14(17)8-6-13/h5-8H,3-4,9-12,17H2,1-2H3
charge 0 multiplicity 1
44 atoms
O  -0.217824 -0.033965 0.550411
O  0.466395 2.18406 0.868852
N  -2.937507 -2.207175 0.113077
N  5.977254 -0.745897 -0.970764
C  -2.569345 0.291819 -0.254103
C  -2.196372 1.359895 -1.320927
C  -3.963599 0.800387 0.227317
C  -2.683921 2.715257 -0.735751
C  -3.86965 2.357748 0.226005
C  -2.599672 -1.138914 -0.86319
C  -1.610879 0.319003 0.9566
C  -1.94887 -3.299215 0.184374
C  -4.32445 -2.697224 0.02911
C  0.739213 0.994014 0.553691
C  2.079097 0.505727 0.153848
C  3.152527 1.436412 0.098532
C  2.336261 -0.853171 -0.175189
C  4.441698 1.03046 -0.272782
C  3.622702 -1.271514 -0.547015
C  4.700377 -0.335355 -0.602788
H  -1.118259 1.364967 -1.560687
H  -2.739928 1.124677 -2.259141
H  -4.728556 0.46896 -0.502736
H  -4.248697 0.385831 1.211787
H  -2.992959 3.416056 -1.531932
H  -1.862029 3.194421 -0.175636
H  -3.672356 2.743047 1.243017
H  -4.821398 2.810309 -0.106206
H  -1.598236 -1.346354 -1.287878
H  -3.315541 -1.142309 -1.717679
H  -1.907822 -0.475084 1.662056
H  -1.590808 1.307232 1.446375
H  -1.907058 -3.930212 -0.740366
H  -0.943857 -2.876591 0.359371
H  -2.190923 -3.964774 1.034017
H  -4.537141 -3.364539 0.884985
H  -5.0300 -1.850986 0.079206
H  -4.538227 -3.268461 -0.911022
H  2.946791 2.481159 0.354739
H  1.51411 -1.573041 -0.130604
H  5.258833 1.761043 -0.310542
H  3.807351 -2.323569 -0.796523
H  6.166294 -1.716218 -1.205399
H  6.74688 -0.083712 -1.009812
