program: Gaussian 09
title: 000299140
version: EM64L-G09RevD.01
frameworkgroup: C1[X(C14H9ClO)]
method: RPBEPBE
basis: SDD
operation: Freq
keyword: #p
keyword: freq=noraman
keyword: PBEPBE/SDD
title: #p freq=noraman PBEPBE/SDD
converged: YES YES NO NO
title: Mulliken charges:
elementType: Cl O C C C C C C C C C C C C C C H H H H H H H H H
charge: -0.101552 -0.092527 -0.701187 0.102496 0.294501 0.268150 0.172699 0.335414 -0.413729 -0.421224 -0.340729 -0.372325 -0.227704 -0.231278 -0.253195 -0.228844 0.247526 0.251887 0.250003 0.244164 0.255868 0.260725 0.239102 0.229608 0.232150
chargesum: 0.00000
title: Mulliken charges with hydrogens summed into heavy atoms:
elementType: Cl O C C C C C C C C C C C C C C
charge: -0.101552 -0.092527 -0.201774 0.102496 0.294501 0.268150 0.172699 0.335414 -0.163726 -0.177060 -0.084861 -0.111600 0.011398 -0.001670 -0.021045 -0.228844
polarizability: 2.22187920e+02 1.88838293e+01 1.92595292e+02 -1.05959382e+01 7.82598136e+00 8.39141351e+01
1716.lowfreq: -7.5469 -2.7216 0.0007 0.0011 0.0017 4.9478 51.7261 62.3461 95.1893
frequency: 51.7133 62.3221 95.1850 131.4499 147.8571 213.9794 240.2496 269.4776 301.0069 347.6608 402.3884 422.2228 429.7409 467.9850 481.8034 533.2081 551.3534 564.7722 624.6229 635.4826 647.5059 710.7355 733.6035 749.8028 781.6285 784.7718 804.8574 827.2068 870.0569 911.8318 943.6524 966.8570 971.6444 984.1164 991.1824 992.6912 1031.3226 1081.4765 1107.9190 1135.2229 1173.1319 1177.8905 1185.0446 1207.0309 1224.0625 1240.5806 1267.3446 1308.7997 1379.4182 1391.4059 1424.3729 1428.1864 1448.7523 1460.2405 1475.7248 1581.0986 1587.5345 1603.2704 1620.0588 1715.9635 2983.4508 3029.5334 3126.5688 3133.6944 3140.3875 3149.3478 3159.3884 3169.4840 3182.1345
redmass: 13.3492 5.5581 5.0139 7.7199 5.7863 5.3062 2.2113 4.7828 6.1384 8.1150 8.3472 6.8993 3.1373 2.9132 5.1573 4.6682 5.9421 3.4414 6.3264 6.8422 6.1670 3.1226 3.5428 1.6691 2.2696 2.2555 2.8729 5.0813 1.3581 1.5117 1.5107 1.6772 4.8169 1.4642 1.4689 5.0031 2.1848 2.0035 1.8886 1.1487 1.1910 1.2017 1.4089 2.1083 2.8586 2.5634 2.7071 1.5696 7.8325 2.7984 2.9018 1.2153 2.4785 2.7659 3.2720 7.3020 6.5422 6.9130 7.1321 13.0783 1.0615 1.0987 1.0867 1.0881 1.0908 1.0911 1.0968 1.0992 1.0959
irintensity: 0.9691 0.1353 1.2255 1.4245 0.1652 0.8515 8.6517 1.8107 6.1947 0.1722 14.0211 15.9481 8.7821 3.3907 10.9426 1.0451 4.9930 0.8086 3.0446 18.3842 25.7521 3.7534 29.9557 153.3124 46.8377 34.5149 11.2604 10.1007 1.1732 2.4570 2.5241 13.1317 34.4720 5.3371 0.4513 3.1099 4.7604 5.4573 2.7039 0.1219 15.8982 11.8581 3.8645 4.5345 55.3887 11.9557 5.5888 5.9972 23.8862 18.2764 14.6187 17.0139 12.8178 8.6575 2.8843 18.4893 2.1065 13.6321 2.0460 337.4097 9.9508 6.2861 2.3448 4.7062 14.5625 6.1396 32.8269 16.9346 8.8227
temp: 298.150 k
press: 1.00000 atm
elementType: 17 8 6 6 6 6 6 6 6 6 6 6 6 6 6 6 1 1 1 1 1 1 1 1 1
symmnumber: 1
zpe: 484346.8 jmol-1
zpe.correction: 0.184478 hartree
zpe.thermalcorrener: 0.196922 hartree
zpe.thermalcorrenthalpy: 0.197866 hartree
zpe.thermalcorrgfe: 0.144957 hartree
zpe.sumelectzpe: -1073.111406 hartree
zpe.sumelectthermal: -1073.098962 hartree
zpe.sumelectthermalent: -1073.098018 hartree
zpe.sumelectthermalfe: -1073.150927 hartree
dipole: -2.4463 4.3302 0.2156
dipole: 4.9781
quadrupole: -90.2080 -90.4090 -105.0533
quadrupole: 8.1061 1.3394 2.7622
quadrupole: 5.0154 4.8144 -9.8299 8.1061 1.3394 2.7622
hfenergy: -1073.2958843 hartree
pointgroup: C01 [X(C14H9Cl1O1)]
dipole: 0.6656317 1.8384465 0.1133948 debye
dipolederiv: -0.2530736 0.1757133 0.2718384 0.0288033 -0.5272448 -0.3335308 0.158949 -0.4079491 -0.7199339 -0.6078126 -0.2628646 0.445755 -0.3769331 -0.6858151 0.2403452 0.3322226 0.0433371 -0.7396161 -0.0291263 -0.0402921 0.0214129 -0.031813 -0.125021 0.0258768 0.0046686 0.0636975 0.1432441 0.5360964 0.1391037 0.0453027 -0.337026 0.0531308 -0.0071535 0.0113616 -0.1596286 0.0075937 -0.028827 0.2533846 -0.0358488 0.5037056 -0.1420168 -0.0093451 -0.0427367 -0.0142145 -0.0292115 -0.071982 -0.1321373 0.0145098 -0.0238349 0.1829672 -0.0111262 0.0007975 -0.0140374 -0.029465 -0.1297372 -0.14778 0.0123319 0.0255596 -0.0463694 -0.001716 -0.0017615 0.020085 -0.0142508 -0.0196456 0.1013974 0.0827263 -0.2967912 -0.5641782 -0.0294175 0.0084124 -0.0135129 -0.1134833 0.2317966 -0.0879593 -0.0047097 -0.0593822 0.1930358 -0.0288328 -0.0233129 -0.0154415 -0.1429433 0.0593343 0.1719162 -0.0187241 0.1434834 -0.0048282 -0.0138536 -0.0132523 -0.0214704 -0.1701633 0.0628313 0.0921262 -0.0215029 -0.0534943 0.0250004 -0.0193111 0.0093516 0.0063439 -0.1017514 -0.0901368 -0.1738693 -0.041763 0.3221857 0.0372944 -0.0278624 0.0362482 0.1093978 -0.1184642 -0.1874291 -0.023821 -0.019569 -0.3205788 -0.0634749 0.0023248 0.0159709 -0.001151 -0.147998 0.0504545 -0.0076499 -0.0048341 0.1384639 0.0023591 -0.017004 -0.0251187 -0.0161608 -0.1488186 -0.2183429 -0.0923397 0.0038334 -0.2015232 0.0907874 -0.034524 0.0149134 -0.027622 -0.152139 0.6759818 0.064667 -0.7953891 0.5577066 1.5765163 0.1741271 -0.56031 0.403661 1.4130934 0.0100933 0.0019369 -0.0289173 -0.0015162 0.0066495 -0.0800278 -0.0392909 -0.1196619 0.0245665 0.0245267 0.0050531 0.0173571 0.0153247 0.0420979 0.0750666 0.0309551 0.1065102 -0.0156517 0.0944345 -0.0335705 0.0049258 0.015971 -0.0988722 0.0115678 0.0073234 0.011741 0.1488721 0.0081824 -0.069376 0.0089008 -0.1232309 -0.0441916 0.0211577 0.0142782 0.0174764 0.153009 0.0615787 -0.0810008 0.0269353 -0.0563444 0.004686 0.019519 0.0359028 0.0130603 0.1320394 -0.015076 -0.0431438 0.0073206 -0.0814269 0.0587792 0.0164232 0.0220983 -0.0111428 0.1480305 -0.0603708 0.0888539 0.0186413 0.0796709 0.0231847 -0.0097202 0.0064321 -0.0093512 0.1629478 -0.137202 0.0322647 -0.0007796 0.0337052 0.0875184 0.007447 0.0011053 0.0093288 0.15793 0.0334516 0.0693872 -0.0097538 0.0993152 -0.0819949 0.0295698 -0.0052083 0.026705 0.1525637 unknown
polarizability: 227.4421153|-11.8769145|188.0346837|-11.3780692|2.0708969|83.2205477 unknown
InChI: InChI=1S/C14H9ClO/c15-14(16)12-7-3-5-10-8-9-4-1-2-6-11(9)13(10)12/h1-7H,8H2
charge 0 multiplicity 1
25 atoms
Cl -1.169039 -2.667407 -1.479954
O  -2.636003 -2.479698 0.813473
C  1.021091 2.245131 -0.196515
C  -0.429708 0.312944 -0.013394
C  -0.40844 1.743664 -0.077283
C  1.83603 0.965975 -0.118988
C  0.972213 -0.168959 -0.003399
C  -1.68906 -0.343211 0.091298
C  -1.586125 2.505104 -0.014844
C  3.233362 0.815574 -0.12035
C  1.528983 -1.461801 0.14891
C  -2.876608 0.438478 0.210546
C  -2.828691 1.845016 0.146813
C  3.783229 -0.482281 0.012051
C  2.933776 -1.60774 0.154041
C  -1.926449 -1.8069 0.070661
H  1.28261 2.954378 0.612546
H  1.180398 2.782929 -1.152341
H  -1.545371 3.598444 -0.07512
H  3.890326 1.68791 -0.213041
H  0.895433 -2.345081 0.256633
H  -3.837349 -0.074413 0.322554
H  -3.756484 2.421538 0.217759
H  4.870451 -0.617788 0.015109
H  3.371028 -2.605406 0.269435
