program: Gaussian 09
title: 000299109
version: EM64L-G09RevD.01
frameworkgroup: C1[X(C10H15N7O2)]
method: RPBEPBE
basis: SDD
operation: Freq
keyword: #p
keyword: freq=noraman
keyword: PBEPBE/SDD
title: #p freq=noraman PBEPBE/SDD
converged: YES YES NO NO
title: Mulliken charges:
elementType: O O N N N N N N N C C C C C C C C C C H H H H H H H H H H H H H H H
charge: -0.468724 -0.444787 -0.223778 -0.063181 -0.094087 -0.080346 -0.120894 -0.617408 -0.585783 -0.070416 -0.120039 -0.504558 -0.125786 -0.486709 -0.420423 0.191970 -0.186869 0.230066 0.008716 0.278158 0.262372 0.250404 0.213989 0.241747 0.239986 0.230533 0.217326 0.230131 0.339091 0.336266 0.331554 0.349083 0.330020 0.332377
chargesum: 0.00000
title: Mulliken charges with hydrogens summed into heavy atoms:
elementType: O O N N N N N N N C C C C C C C C C C
charge: -0.129633 -0.108522 -0.223778 -0.063181 -0.094087 -0.080346 -0.120894 0.063229 0.076614 0.207743 0.142334 -0.040165 0.115961 -0.016190 0.027034 0.191970 -0.186869 0.230066 0.008716
polarizability: 2.22849202e+02 -1.16529808e+01 1.67641138e+02 -1.70797606e+01 -1.10130593e+01 1.12683543e+02
1716.lowfreq: -20.2015 -14.7264 0.0007 0.0008 0.0010 4.6309 9.5039 15.3005 47.4093
frequency: -17.8585 14.8590 47.3583 86.0603 90.1419 125.5428 136.9569 173.5130 197.9452 221.3739 227.1505 252.6504 272.1617 276.2185 300.7880 329.7159 343.3271 382.5694 412.0550 444.2241 459.7375 477.1237 500.0289 516.8759 519.5283 533.2422 545.3351 583.6826 612.5524 635.4971 656.4185 671.0952 686.1965 719.6201 732.8803 791.6499 795.2813 807.2286 851.3838 877.9619 900.5315 919.5444 928.1634 951.5540 958.0775 991.2647 1017.7778 1030.6850 1060.7656 1065.2237 1082.0611 1118.2575 1129.0459 1146.8979 1158.3914 1177.2308 1203.1512 1222.4250 1235.7048 1263.5275 1265.7516 1272.5775 1278.1915 1289.5205 1313.2647 1319.9816 1349.4394 1354.4088 1363.9470 1367.3860 1369.8497 1402.4829 1441.4840 1458.8663 1461.6386 1467.4083 1493.5203 1569.7228 1580.0350 1602.3332 1636.4835 2986.8593 2997.1614 3008.8358 3014.6851 3027.9985 3050.1148 3071.4350 3093.5841 3098.2795 3539.9533 3561.5256 3563.5816 3571.5075 3694.3913 3723.1036
redmass: 4.8073 6.1014 5.3946 3.8815 2.7428 4.7864 6.7014 3.4970 5.4599 4.8592 3.2325 1.3115 2.3086 3.6983 1.5731 5.0828 3.6543 2.2672 5.0275 2.8474 1.2118 7.5116 3.1802 1.2227 4.6668 1.0507 1.1035 3.5609 5.8626 4.7569 4.6112 7.3513 6.7494 11.4489 5.6834 4.9576 6.6671 8.6792 2.1936 1.8887 3.7376 2.5441 2.8667 4.4206 1.9344 2.0491 3.6158 3.7216 2.2954 1.9803 1.9504 2.5975 2.1258 1.2056 1.5518 3.1117 1.6107 1.8143 1.5337 6.7102 3.1368 1.3403 1.3708 1.3537 1.4078 1.2239 1.3576 5.4378 1.3927 1.2895 1.4151 6.7404 1.0872 4.9324 1.1160 1.0938 3.1493 2.2560 9.9375 1.4495 2.2526 1.0638 1.0677 1.0836 1.0634 1.0836 1.0866 1.1004 1.1027 1.1000 1.0445 1.0661 1.0442 1.0664 1.1056 1.1060
irintensity: 1.8453 0.6358 0.7579 4.1805 5.2056 1.9841 1.0886 2.7288 11.2004 2.1438 11.5312 135.3441 42.7667 12.4598 128.5975 24.1830 2.4682 19.3745 3.9743 2.1925 241.5635 1.8700 14.5257 285.9965 4.5672 24.5368 26.1662 0.7334 0.8271 7.1469 9.2740 5.7356 9.8927 9.4785 4.0221 9.0036 9.6315 4.3001 33.9432 26.1355 15.6547 12.5992 4.1055 74.6081 1.4460 35.8930 82.1715 20.4723 17.7502 27.0861 19.5419 7.3994 0.9428 18.1279 4.6866 16.6015 2.8110 37.6920 15.7950 2.7558 70.1181 15.5417 13.5596 1.5833 3.2288 9.4724 0.8855 103.4063 14.0312 10.2312 3.2629 94.1760 16.3337 16.2455 9.2254 10.6006 155.2798 87.1465 475.3400 501.9214 444.2921 26.4211 30.6437 13.8689 17.8062 23.2451 12.8267 29.6918 21.1379 27.2529 125.5232 7.5149 132.7214 7.0357 48.8290 48.4987
temp: 298.150 k
press: 1.00000 atm
elementType: 8 8 7 7 7 7 7 7 7 6 6 6 6 6 6 6 6 6 6 1 1 1 1 1 1 1 1 1 1 1 1 1 1 1
symmnumber: 1
zpe: 702982.7 jmol-1
zpe.correction: 0.267752 hartree
zpe.thermalcorrener: 0.284571 hartree
zpe.thermalcorrenthalpy: 0.285515 hartree
zpe.thermalcorrgfe: 0.222818 hartree
zpe.sumelectzpe: -922.331288 hartree
zpe.sumelectthermal: -922.314468 hartree
zpe.sumelectthermalent: -922.313524 hartree
zpe.sumelectthermalfe: -922.376222 hartree
dipole: -3.8396 1.5715 -2.6649
dipole: 4.9309
quadrupole: -100.5210 -98.9962 -115.0535
quadrupole: -1.8013 -17.4708 -0.4829
quadrupole: 4.3359 5.8607 -10.1966 -1.8013 -17.4708 -0.4829
hfenergy: -922.5990396 hartree
pointgroup: C01 [X(C10H15N7O2)]
dipole: -1.5361504 1.1406796 -0.3201588 debye
polarizability: 221.278047|4.3595297|154.3233528|-23.9972574|25.6547919|127.5724837 unknown
InChI: InChI=1S/C10H15N7O2/c11-8-7-9(14-10(12)13-8)17(16-15-7)5-1-4(3-18)6(19)2-5/h4-6,18-19H,1-3,11-12H2
charge 0 multiplicity 1
34 atoms
O  4.59147 0.590008 -1.357148
O  3.993611 -1.082433 2.432246
N  0.037926 0.182574 -0.555637
N  0.204567 -1.071607 -1.237566
N  -0.977765 -1.712747 -1.198924
N  -1.838379 1.316614 0.596973
N  -3.895265 -0.071455 0.520739
N  -3.972576 -2.184813 -0.517642
N  -3.85763 2.018247 1.555576
C  2.99091 -0.373369 0.261812
C  1.160375 1.125271 -0.379125
C  2.060633 0.733623 0.825936
C  3.228883 0.020556 -1.229577
C  2.138833 1.081551 -1.580293
C  4.282981 -0.585994 1.071539
C  -1.256215 0.298157 -0.094359
C  -1.887149 -0.907153 -0.511268
C  -3.269364 -1.064281 -0.169086
C  -3.162719 1.054387 0.864418
H  2.43268 -1.327854 0.2650
H  0.692558 2.115854 -0.242134
H  1.462425 0.41105 1.695645
H  2.653975 1.62348 1.118312
H  3.13812 -0.872222 -1.876558
H  1.620208 0.875482 -2.530729
H  2.63834 2.065538 -1.650352
H  4.881074 0.345229 1.104009
H  4.901669 -1.374834 0.61615
H  4.812146 0.670607 -2.318585
H  3.532726 -0.368196 2.940834
H  -4.952528 -2.258064 -0.252474
H  -3.512082 -2.934531 -1.029398
H  -3.378445 2.868908 1.836843
H  -4.837596 1.860516 1.771726
