program: Gaussian 09
title: 000299106
version: EM64L-G09RevD.01
frameworkgroup: C1[X(C10H13N5O4S)]
method: RPBEPBE
basis: SDD
operation: Freq
keyword: #p
keyword: freq=noraman
keyword: PBEPBE/SDD
title: #p freq=noraman PBEPBE/SDD
converged: YES YES NO NO
title: Mulliken charges:
elementType: S O O O O N N N N N C C C C C C C C C C H H H H H H H H H H H H H
charge: 0.293190 -0.240188 -0.439744 -0.443137 -0.433929 -0.081974 -0.101885 0.003289 0.042921 0.004337 -0.170171 -0.184310 -0.097886 -0.100248 -0.376322 0.154403 -0.066201 -0.317776 -0.361979 -0.813687 0.279047 0.274531 0.263821 0.298204 0.219149 0.255202 0.356200 0.362821 0.342934 0.253738 0.288204 0.249636 0.287811
chargesum: 0.00000
title: Mulliken charges with hydrogens summed into heavy atoms:
elementType: S O O O O N N N N N C C C C C C C C C C
charge: 0.293190 -0.240188 -0.083544 -0.080316 -0.090995 -0.081974 -0.101885 0.003289 0.042921 0.004337 0.108876 0.090221 0.165935 0.197956 0.098028 0.154403 -0.066201 -0.317776 -0.108242 0.011964
polarizability: 2.48158527e+02 -1.02781378e+01 1.93701615e+02 4.81253892e+00 5.38564844e+00 1.02183370e+02
1716.lowfreq: -8.1965 -2.7308 0.0013 0.0014 0.0015 3.2924 24.3948 32.4763 54.6753
frequency: 24.1986 32.4696 54.6639 72.9080 84.8310 100.4091 103.6706 132.4127 141.1380 170.2851 179.7282 211.8562 230.5786 242.0421 259.3218 282.1912 290.2620 308.4615 314.2192 355.8679 380.5293 398.3741 422.9750 462.1905 526.5944 539.9391 559.7494 580.9775 616.7866 653.3453 655.6685 669.5575 694.6504 706.0935 755.1856 779.8759 805.2960 830.1798 841.1071 880.0178 926.6374 934.1405 939.8476 954.6553 968.5820 974.0505 979.7826 995.1511 998.4287 1018.5937 1038.5027 1054.7430 1076.4321 1117.1239 1119.2788 1158.6647 1172.3335 1207.1843 1218.2503 1228.8966 1239.7762 1274.5428 1285.9414 1290.2520 1301.1541 1322.6117 1324.2469 1334.6123 1344.6835 1348.6095 1353.8979 1368.6854 1391.4394 1411.0784 1433.4085 1436.7083 1446.4736 1474.7685 1481.3928 1537.6642 2996.4540 3022.2799 3030.2236 3035.8098 3069.9897 3102.3220 3107.3380 3158.3886 3163.0463 3176.0507 3259.2501 3563.3450 3576.6462
redmass: 6.3929 6.5616 5.2966 5.0115 4.9090 1.1959 3.9463 6.1038 4.3018 4.9443 5.7586 4.2648 5.4591 5.1397 7.2430 5.7836 3.8251 1.2353 1.7058 2.6177 4.9209 7.5327 6.0093 7.0543 4.7545 7.9452 5.3466 10.3491 7.8069 7.4839 5.6749 6.4326 1.9526 2.3933 5.3893 6.5674 11.3735 2.7969 7.3020 3.6624 3.8383 1.4435 7.8628 3.2250 4.2809 3.7365 1.1808 3.2887 1.8102 3.6092 5.5293 1.8608 1.6111 6.7625 5.0550 1.4173 1.3281 1.6205 8.0772 5.0237 1.3522 1.1838 1.3681 1.2217 9.4097 4.2893 1.3511 1.4374 1.4098 2.0851 1.4553 1.2120 1.4998 1.9647 1.0520 1.1496 1.0608 1.0761 10.2516 11.3145 1.0664 1.0865 1.0279 1.0873 1.0868 1.0877 1.0997 1.1048 1.1057 1.0925 1.0683 1.0664 1.0664
irintensity: 0.4999 0.5421 1.3662 2.7535 2.9041 0.2697 1.4275 0.9207 9.3712 2.8945 6.3299 6.3744 2.0413 2.5684 0.4429 6.7477 22.4368 269.0344 27.3581 41.1980 4.9165 7.2632 3.7121 5.5712 34.2502 6.2798 6.9459 10.5319 0.3380 1.2274 10.3070 29.6143 66.2974 23.0386 60.3994 41.2855 0.3152 5.9487 107.2105 18.8260 53.3908 10.8152 14.5742 43.1580 53.8155 60.9432 6.0994 152.5388 32.0607 41.9317 110.5876 17.5810 19.6581 25.7901 2.0076 11.1617 20.4842 42.5529 38.5654 15.8943 3.4539 9.5317 12.4730 5.1497 24.4194 106.7582 9.3127 1.7135 23.6752 75.3713 10.3234 5.7641 4.8569 19.5348 15.5716 29.4898 15.6925 8.7547 176.0428 36.5349 46.9745 31.3653 14.4888 14.7563 24.5282 2.7330 11.6031 5.2024 6.8172 14.5776 560.8857 10.0733 17.9380
temp: 298.150 k
press: 1.00000 atm
elementType: 16 8 8 8 8 7 7 7 7 7 6 6 6 6 6 6 6 6 6 6 1 1 1 1 1 1 1 1 1 1 1 1 1
symmnumber: 1
zpe: 634588.9 jmol-1
zpe.correction: 0.241702 hartree
zpe.thermalcorrener: 0.260708 hartree
zpe.thermalcorrenthalpy: 0.261652 hartree
zpe.thermalcorrgfe: 0.193033 hartree
zpe.sumelectzpe: -1359.995963 hartree
zpe.sumelectthermal: -1359.976958 hartree
zpe.sumelectthermalent: -1359.976014 hartree
zpe.sumelectthermalfe: -1360.044633 hartree
dipole: -1.4134 2.8021 0.5021
dipole: 3.1783
quadrupole: -113.1825 -136.6452 -117.1714
quadrupole: -9.2392 -0.3720 -7.2630
quadrupole: 9.1505 -14.3122 5.1617 -9.2392 -0.3720 -7.2630
hfenergy: -1360.2376655 hartree
pointgroup: C01 [X(C10H13N5O4S1)]
dipole: -0.3860319 -0.8852685 -0.7942816 debye
polarizability: 244.4188494|11.4593528|167.1264451|13.4690953|44.760229|132.4982179 unknown
InChI: InChI=1S/C10H13N5O4S/c1-20-9-5-8(11-3-12-9)14-15(13-5)10-7(18)6(17)4(2-16)19-10/h3-4,6-7,10,16-18H,2H2,1H3
charge 0 multiplicity 1
33 atoms
S  -2.67529 -2.121313 -1.736702
O  2.072409 0.056746 1.465039
O  3.469764 1.971727 -0.538586
O  1.878091 -1.290086 -1.526893
O  5.370567 -1.511638 0.523395
N  0.103473 0.926451 0.402539
N  -0.402167 -0.121523 -0.338899
N  -0.797751 1.741344 1.032821
N  -3.264866 1.621267 1.015027
N  -4.127649 -0.254576 -0.327705
C  2.823502 -0.455228 -0.802605
C  2.357896 1.033205 -0.726714
C  2.984869 -0.851137 0.684583
C  1.568632 1.109305 0.603305
C  4.410979 -0.657886 1.238678
C  -1.75714 0.035166 -0.181835
C  -2.010294 1.182337 0.660883
C  -2.89574 -0.681587 -0.675285
C  -4.250416 0.862074 0.491258
C  -4.474513 -2.589136 -2.032653
H  3.781687 -0.561788 -1.337371
H  1.743304 1.297095 -1.608417
H  2.625267 -1.88464 0.842402
H  1.677001 2.087206 1.096529
H  4.415932 -0.853628 2.329101
H  4.746225 0.374812 1.057917
H  4.070493 1.925773 -1.324387
H  0.949969 -1.1025 -1.184914
H  5.189078 -2.462256 0.734597
H  -5.277571 1.150379 0.731517
H  -4.956202 -2.818756 -1.072651
H  -4.439498 -3.475024 -2.684564
H  -4.99484 -1.754381 -2.521412
