program: Gaussian 09
title: 000299094
version: EM64L-G09RevD.01
frameworkgroup: C1[X(C14H20N2O4)]
method: RPBEPBE
basis: SDD
operation: Freq
keyword: #p
keyword: freq=noraman
keyword: PBEPBE/SDD
title: #p freq=noraman PBEPBE/SDD
converged: YES YES NO NO
title: Mulliken charges:
elementType: O O O O N N C C C C C C C C C C C C C C H H H H H H H H H H H H H H H H H H H H
charge: -0.297883 -0.248092 -0.200680 -0.201929 -0.110211 0.027521 0.347525 -0.412608 -0.337969 -0.749616 -0.726416 -0.645671 -0.641316 0.201825 0.236758 -0.324176 -0.312917 -0.352589 -0.345910 0.388276 0.218673 0.206164 0.222646 0.273598 0.207998 0.247122 0.209344 0.211043 0.213706 0.224256 0.191534 0.223807 0.256453 0.236685 0.225585 0.194773 0.282858 0.279296 0.291199 0.289338
chargesum: 0.00000
title: Mulliken charges with hydrogens summed into heavy atoms:
elementType: O O O O N N C C C C C C C C C C C C C C
charge: -0.297883 -0.248092 -0.200680 -0.201929 -0.110211 0.027521 0.347525 0.012229 0.158275 -0.085152 -0.077410 0.026122 0.015727 0.201825 0.236758 -0.041318 -0.033621 -0.061390 -0.056572 0.388276
polarizability: 2.63240266e+02 -6.40073597e+00 1.78391110e+02 -2.07214504e+01 -1.76926145e+01 1.26925931e+02
1716.lowfreq: -14.3756 -11.7699 -4.7223 -3.3682 -0.0003 0.0001 0.0003 22.8103 44.9129
frequency: -11.6973 22.6776 44.8400 51.9760 60.5657 68.4622 74.4012 93.5588 135.1692 161.1177 185.0821 189.6960 213.9793 222.0795 229.8931 235.7879 253.2111 260.4198 278.6189 291.0003 306.9058 316.4326 359.5852 409.3346 415.0906 421.7110 439.9992 456.0052 487.5539 502.0058 506.8185 541.4147 623.5749 650.8514 674.7068 683.9160 744.5916 763.1512 779.9096 808.5001 817.2614 863.4716 885.9770 888.5825 898.1812 899.0958 924.2247 938.0784 989.2029 1003.5491 1005.1024 1011.7161 1023.7952 1038.8996 1043.4524 1065.4297 1089.2885 1090.2440 1107.1763 1128.1308 1136.9161 1173.4282 1185.0279 1210.1183 1216.0769 1243.4719 1251.7014 1268.2085 1276.6213 1290.5482 1321.0587 1345.2461 1347.4618 1367.5290 1369.5035 1391.0150 1405.0951 1413.9753 1422.3891 1441.6384 1458.3476 1462.7487 1466.1863 1468.7066 1471.5135 1473.7884 1475.9187 1478.9057 1481.2726 1486.7584 1495.7840 1588.8146 1609.0403 1618.5824 2855.2713 2866.1164 2933.5220 2972.6295 2976.6563 3006.3918 3008.7993 3021.6139 3025.7745 3063.6603 3069.8967 3079.6281 3082.8009 3082.9792 3086.9603 3089.4553 3164.4375 3175.0997 3187.9272 3192.7889
redmass: 4.6850 5.2962 3.9916 9.4349 3.0752 5.8276 5.1680 4.2657 4.0493 2.3431 3.9275 1.1651 1.7536 1.2604 1.8911 2.4371 1.1467 5.6940 3.2678 3.9604 2.6357 2.8077 3.6146 2.8812 2.5904 2.0141 2.0203 4.0946 8.6781 3.8543 3.6069 4.9750 7.1300 6.2174 8.1316 3.9182 4.8354 5.0951 5.9434 5.5748 4.5652 1.2474 4.1990 1.6995 2.0778 2.0452 1.8730 1.4413 1.4281 1.4531 2.7922 1.3684 1.5614 1.5273 2.2109 4.0755 3.2714 1.2533 1.3267 1.6708 1.4057 1.2216 1.6757 3.5858 4.4317 4.0136 2.4575 2.6148 1.9588 1.2612 1.5126 1.3784 1.4647 7.7514 1.1982 1.2139 8.0030 4.6685 1.1373 1.1257 1.0745 1.0609 1.0894 1.0500 1.1190 1.7712 1.1869 1.0583 1.0582 1.0561 1.0621 8.9833 6.4684 9.8865 1.0567 1.0564 1.0622 1.0352 1.0357 1.0956 1.0610 1.0733 1.0743 1.0995 1.0989 1.0994 1.0998 1.0998 1.1002 1.1058 1.0901 1.0890 1.0957 1.0973
irintensity: 0.0669 0.2110 0.3918 0.5254 0.5646 0.0616 1.7928 3.0509 3.1568 0.8483 3.2638 0.2629 0.4099 0.0257 2.0255 6.7156 0.2828 0.4682 3.3952 2.1246 1.8721 16.5329 6.4545 0.0095 1.4362 3.2111 0.3501 0.9811 7.5149 0.7805 0.9276 0.4576 0.3242 0.2261 1.7854 57.7839 13.2473 3.8557 26.7018 11.3407 10.5397 0.8879 10.7503 50.6611 17.8310 14.3627 54.6006 5.1708 5.1323 6.4644 34.3272 0.0103 4.4910 18.2285 73.2727 281.2776 12.7970 3.1987 11.3738 20.0297 3.9659 3.8880 0.2237 310.4478 222.3266 149.1552 16.9276 10.1411 13.6753 0.2711 1.1404 10.1914 24.4953 84.6481 20.3052 20.9453 12.0407 61.7917 2.1056 6.3757 3.9741 2.6730 8.4258 4.8370 14.1281 6.0289 6.0020 24.2833 3.9664 5.5527 30.2257 57.3910 5.3485 111.6530 77.6844 197.2973 60.8990 28.0606 34.1953 23.7243 35.9937 32.5331 37.9274 10.7595 63.6101 30.3898 44.5771 13.3119 42.3199 7.7030 1.2278 1.2254 0.3779 0.6536
temp: 298.150 k
press: 1.00000 atm
elementType: 8 8 8 8 7 7 6 6 6 6 6 6 6 6 6 6 6 6 6 6 1 1 1 1 1 1 1 1 1 1 1 1 1 1 1 1 1 1 1 1
symmnumber: 1
zpe: 847741.2 jmol-1
zpe.correction: 0.322888 hartree
zpe.thermalcorrener: 0.343254 hartree
zpe.thermalcorrenthalpy: 0.344198 hartree
zpe.thermalcorrgfe: 0.273084 hartree
zpe.sumelectzpe: -954.264812 hartree
zpe.sumelectthermal: -954.244445 hartree
zpe.sumelectthermalent: -954.243501 hartree
zpe.sumelectthermalfe: -954.314615 hartree
dipole: -5.3823 1.0138 -0.3751
dipole: 5.4897
quadrupole: -146.3524 -117.1208 -121.5362
quadrupole: -5.3293 10.2409 3.8494
quadrupole: -18.0159 11.2157 6.8003 -5.3293 10.2409 3.8494
hfenergy: -954.5876994 hartree
pointgroup: C01 [X(C14H20N2O4)]
dipole: 2.1216044 -0.2840903 0.2879722 debye
polarizability: 265.8990418|8.63432|121.4243814|-1.6369391|-13.2175492|181.2338833 unknown
InChI: InChI=1S/C14H20N2O4/c1-14(2,9-15(3)4)10-20-13(17)11-5-7-12(8-6-11)16(18)19/h5-8H,9-10H2,1-4H3
charge 0 multiplicity 1
40 atoms
O  1.082669 0.842866 0.558152
O  0.621748 1.581285 -1.613841
O  -6.159261 0.12109 -0.342114
O  -5.618515 -0.495062 1.786302
N  3.770053 -1.120187 -1.189394
N  -5.307885 -0.065435 0.609518
C  3.380332 0.042019 1.056401
C  3.258359 -1.260438 0.19623
C  2.540302 1.164111 0.413801
C  4.845873 0.544586 1.074696
C  2.902569 -0.259678 2.49883
C  2.77223 -1.381354 -2.246911
C  5.046838 -1.817509 -1.439229
C  0.239455 1.120477 -0.509693
C  -1.188296 0.79715 -0.182845
C  -2.160092 0.988916 -1.198979
C  -1.577691 0.32123 1.096125
C  -3.515046 0.707199 -0.947848
C  -2.93014 0.036595 1.36188
C  -3.876885 0.234126 0.33286
H  2.190288 -1.557824 0.173405
H  3.796995 -2.073581 0.731146
H  2.688586 2.126757 0.936731
H  2.781433 1.272091 -0.657945
H  5.508229 -0.216526 1.527804
H  5.19901 0.748684 0.048432
H  4.942689 1.470247 1.673124
H  3.555527 -1.017406 2.970881
H  2.932737 0.650584 3.126454
H  1.866816 -0.643105 2.506441
H  2.434558 -2.4476 -2.287679
H  3.205138 -1.125825 -3.231301
H  1.886561 -0.739741 -2.103679
H  5.792235 -1.533299 -0.677429
H  5.444627 -1.522162 -2.427414
H  4.951232 -2.932974 -1.428279
H  -1.830918 1.360465 -2.174215
H  -0.817182 0.184864 1.868751
H  -4.286238 0.844849 -1.709781
H  -3.263438 -0.329586 2.336113
