program: Gaussian 09
title: 000299170
version: EM64L-G09RevD.01
frameworkgroup: C1[X(C28H22O2)]
method: RPBEPBE
basis: SDD
operation: Freq
keyword: #pfreq=noraman
keyword: PBEPBE/SDD
title: #p freq=noraman PBEPBE/SDD
converged: YES YES NO NO
title: Mulliken charges:
elementType: O O C C C C C C C C C C C C C C C C C C C C C C C C C C C C H H H H H H H H H H H H H H H H H H H H H H
charge: -0.265232 -0.238361 -0.418839 0.393999 0.366604 0.055972 -0.592714 0.421497 0.169391 0.164506 -0.385949 -0.392930 0.404255 0.389792 -0.474612 -0.475084 -0.301445 -0.499962 0.266824 -0.337442 -0.392805 -0.264096 -0.479774 -0.463124 -0.439332 -0.295879 -0.281447 -0.253459 -0.247682 -0.506430 0.283005 0.270259 0.256723 0.236579 0.263033 0.242002 0.235738 0.229619 0.237433 0.263288 0.265630 0.227338 0.240239 0.238642 0.239750 0.234106 0.231669 0.228746 0.230544 0.247095 0.231684 0.240639
chargesum: 0.00000
title: Mulliken charges with hydrogens summed into heavy atoms:
elementType: O O C C C C C C C C C C C C C C C C C C C C C C C C C C C C
charge: -0.265232 -0.238361 -0.135834 0.393999 0.366604 0.055972 -0.065732 0.421497 0.169391 0.164506 -0.149371 -0.129898 0.404255 0.389792 -0.232610 -0.239346 -0.071826 -0.262529 0.266824 -0.074154 -0.127176 -0.036758 -0.239534 -0.224482 -0.199581 -0.061773 -0.049778 -0.024713 -0.017138 0.212989
polarizability: 3.77931497e+02 2.53525370e+01 2.97621617e+02 2.91430666e+01 6.08364495e+01 2.77037054e+02
1716.lowfreq: -0.0008 -0.0005 0.0001 1.4952 6.9522 9.3215 22.3115 29.0616 35.1553
frequency: 22.2359 29.0607 35.1134 36.7132 43.2965 55.5614 89.3809 102.3529 103.4235 128.3407 147.8328 165.4104 175.6564 181.9527 193.5416 205.2727 224.5446 257.2939 258.7926 293.2470 303.2832 370.9376 392.7492 407.4264 416.0902 420.2538 438.9936 455.4863 473.6012 495.7938 501.1712 503.9823 508.4510 534.8631 536.7203 557.8813 569.8870 591.4325 607.2339 611.8756 644.1629 656.7436 675.7511 684.6050 711.2960 725.9298 748.2375 751.5288 766.6611 778.5522 783.3056 787.2505 789.6489 817.9702 819.2782 827.6808 833.0468 852.3564 875.9166 885.6908 886.7337 916.6756 929.5275 931.8046 954.4911 960.3555 967.9173 974.6044 977.9371 985.5894 988.3437 991.3743 993.2262 996.1084 1020.8993 1035.5328 1039.4941 1057.7397 1083.9182 1099.8629 1112.8219 1122.0812 1134.9282 1148.8575 1150.3838 1165.0864 1175.6360 1177.8017 1178.8795 1183.4764 1217.0007 1227.6081 1233.4184 1233.9259 1238.4019 1244.9299 1255.7818 1274.4327 1290.3550 1301.8516 1321.8277 1344.0854 1372.8764 1384.6090 1393.6678 1404.4107 1410.5901 1414.6017 1421.5971 1422.8768 1437.4191 1440.6402 1452.6587 1453.4843 1455.2132 1463.5339 1471.3823 1502.3542 1516.2125 1530.4977 1577.4419 1587.7438 1599.2164 1603.5182 1618.5050 1630.9243 1631.3352 1640.5271 3005.3090 3012.4485 3021.7880 3103.2279 3108.0880 3117.6153 3120.5614 3121.5033 3123.5250 3123.8635 3131.2772 3135.6196 3141.9030 3143.4212 3144.5119 3146.2619 3149.4624 3158.4080 3160.5552 3162.8943 3163.4545 3207.6866
redmass: 5.3863 4.5877 5.3687 5.7857 4.9301 5.6415 4.5835 1.1008 4.4942 4.3108 4.4249 4.9941 4.8121 4.1803 4.9434 4.9691 3.8100 4.2898 4.6093 3.8847 4.3491 3.5767 4.8515 3.5923 3.8444 3.7910 3.4951 4.1605 3.2984 3.9863 4.4596 6.0945 6.8027 3.9837 6.3323 3.4791 3.6933 4.9150 3.2222 4.5284 5.0313 3.4065 5.3141 4.4051 5.3140 3.6012 1.3261 1.4532 2.4451 3.6577 1.7883 2.4040 3.2324 1.6199 2.0177 4.5701 4.5189 2.3150 2.0357 2.5901 1.6114 1.5983 2.6973 1.6021 2.6185 1.3952 1.4182 2.9643 1.5678 2.5001 2.0900 1.3573 1.3804 1.3481 3.6169 2.2861 3.3271 2.7340 2.2240 2.0585 1.2709 2.1405 1.7356 1.4415 1.4576 1.2808 1.1769 1.1404 1.3153 1.2387 1.4289 1.7432 2.0484 1.8238 2.0790 2.1147 1.6234 1.8018 1.5545 1.9643 1.7512 1.7607 2.1892 2.3151 6.5433 2.9572 2.5234 2.6374 1.2123 2.7498 2.3676 2.4398 1.0500 2.2078 2.3333 1.0518 1.1264 3.3914 3.5442 4.3481 7.1794 7.5266 5.1916 5.3794 6.1058 6.3961 6.9068 9.3238 1.0294 1.0660 1.0819 1.0940 1.1046 1.0862 1.0865 1.0862 1.0866 1.0863 1.0879 1.0906 1.0919 1.0940 1.0961 1.0945 1.1049 1.0988 1.0979 1.1001 1.0978 1.0915
irintensity: 0.3984 0.3812 0.0669 1.4978 0.1214 0.3847 0.5393 0.3834 0.0392 0.3709 1.2442 0.8184 1.1045 3.8783 2.5891 1.9414 3.0351 4.1355 1.5379 19.2846 1.2039 6.9988 1.0731 3.2819 2.3693 1.4918 17.6625 4.3376 0.7786 3.1111 1.4007 3.2249 0.8594 1.4069 3.2679 4.2935 2.0815 1.0963 1.0198 1.5500 3.7863 0.2253 5.7003 1.3639 0.7578 12.7459 58.3340 21.1986 7.3802 2.7558 2.6590 30.8266 14.3709 86.3112 6.4226 4.1309 8.9134 45.4168 9.8393 3.8683 14.1956 5.4395 7.3610 4.6268 10.6003 4.5561 2.4781 17.5672 1.3822 0.7788 2.6859 1.7859 1.3182 0.4375 5.1975 6.7490 1.9634 3.1708 8.5492 90.5642 0.2998 84.6285 27.8283 9.9395 4.6657 3.5343 5.8865 3.8380 19.1812 10.7446 42.7681 11.5530 3.9807 2.1888 11.9069 5.7552 22.9864 11.1420 12.3270 25.2207 53.1856 6.1033 6.2728 4.2836 0.4432 7.0283 2.4842 3.5562 21.1159 1.0026 11.1602 9.5831 13.3825 8.1680 3.6801 7.2962 24.8523 1.8751 10.3663 1.3818 2.1177 2.8452 9.3199 2.5679 3.4624 3.2287 0.0065 110.4231 35.9670 10.3035 1.5416 4.6947 23.7947 0.9957 3.3886 1.5710 2.9249 2.1127 3.1100 15.4378 10.2710 22.4582 54.9237 35.1667 15.9844 37.5315 19.8897 32.6570 18.9010 2.6038
temp: 298.150 k
press: 1.00000 atm
elementType: 8 8 6 6 6 6 6 6 6 6 6 6 6 6 6 6 6 6 6 6 6 6 6 6 6 6 6 6 6 6 1 1 1 1 1 1 1 1 1 1 1 1 1 1 1 1 1 1 1 1 1 1
symmnumber: 1
zpe: 1088181.1 jmol-1
zpe.correction: 0.414466 hartree
zpe.thermalcorrener: 0.438784 hartree
zpe.thermalcorrenthalpy: 0.439728 hartree
zpe.thermalcorrgfe: 0.359058 hartree
zpe.sumelectzpe: -1228.607858 hartree
zpe.sumelectthermal: -1228.583541 hartree
zpe.sumelectthermalent: -1228.582596 hartree
zpe.sumelectthermalfe: -1228.663266 hartree
dipole: -0.2634 1.0741 0.7535
dipole: 1.3382
quadrupole: -150.3738 -160.7074 -169.5384
quadrupole: 6.6915 2.7188 3.6213
quadrupole: 9.8327 -0.5008 -9.3319 6.6915 2.7188 3.6213
hfenergy: -1229.0223245 hartree
pointgroup: C01 [X(C28H22O2)]
dipole: -0.0756827 -0.4235672 -0.3033856 debye
polarizability: 381.6610838|-22.1981211|293.8657587|-30.0446206|59.0314904|277.0633251 unknown
InChI: InChI=1S/C28H22O2/c1-30-27(29)18-26(24-14-6-10-19-8-2-4-12-22(19)24)25-15-7-11-21-17-16-20-9-3-5-13-23(20)28(21)25/h2-17,26H,18H2,1H3
charge 0 multiplicity 1
52 atoms
O  1.12748 -4.095561 1.147879
O  0.954008 -2.175199 2.455399
C  -0.278555 -0.937893 -0.003136
C  1.072133 -0.69996 -0.707231
C  -1.522369 -0.532102 -0.817487
C  1.898247 0.4716 -0.476137
C  -0.462867 -2.426327 0.45122
C  3.265347 0.426221 -0.963492
C  1.483426 1.691878 0.245161
C  -2.776825 -0.257546 -0.140376
C  1.566573 -1.72941 -1.537281
C  -1.482625 -0.477268 -2.216502
C  2.489971 2.649127 0.656945
C  -3.956467 0.04435 -0.931591
C  3.716173 -0.642846 -1.793445
C  4.220406 1.443465 -0.582736
C  2.860387 -1.69682 -2.114676
C  3.864021 2.483201 0.246375
C  0.595855 -2.840583 1.456349
C  0.121343 2.045306 0.513492
C  -2.910396 -0.252386 1.291735
C  -2.644215 -0.172663 -2.990863
C  -3.862315 0.07626 -2.361827
C  2.122864 3.805104 1.4121
C  -5.201549 0.313513 -0.271939
C  -0.221914 3.199338 1.233737
C  -4.135811 0.018303 1.906114
C  0.785438 4.075239 1.721214
C  -5.296643 0.298533 1.120223
C  2.164853 -4.596202 2.084153
H  -0.252651 -0.358658 0.937205
H  -1.445657 -2.509108 0.953189
H  -0.479758 -3.130801 -0.393257
H  0.944781 -2.610225 -1.723096
H  -0.534739 -0.660268 -2.731579
H  4.749264 -0.625361 -2.160012
H  5.248494 1.345965 -0.950832
H  3.191875 -2.514872 -2.762698
H  4.601948 3.226561 0.569837
H  -0.691333 1.45268 0.096385
H  -2.038013 -0.448292 1.923907
H  -2.567249 -0.138063 -4.083038
H  -4.760078 0.305785 -2.948095
H  2.914563 4.496372 1.725506
H  -6.082453 0.536197 -0.886143
H  -1.279391 3.428589 1.405198
H  -4.207893 0.019759 2.999237
H  0.514102 4.965796 2.298352
H  -6.252341 0.505837 1.613814
H  3.023453 -3.904456 2.102035
H  2.452794 -5.578671 1.684995
H  1.750111 -4.684435 3.102412
