program: Gaussian 09
title: 000299092
version: EM64L-G09RevD.01
frameworkgroup: C1[X(C15H20N2O4)]
method: RPBEPBE
basis: SDD
operation: Freq
keyword: #p
keyword: freq=noraman
keyword: PBEPBE/SDD
title: #p freq=noraman PBEPBE/SDD
converged: YES YES NO NO
title: Mulliken charges:
elementType: O O O O N N C C C C C C C C C C C C C C C H H H H H H H H H H H H H H H H H H H H
charge: -0.294218 -0.243440 -0.201489 -0.203292 -0.100128 0.027136 0.417290 -0.565079 -0.545564 -0.461299 -0.468608 -0.363211 -0.613931 -0.629383 0.218384 0.229600 -0.321726 -0.313715 -0.353364 -0.346556 0.387852 0.230807 0.234116 0.242111 0.220593 0.218921 0.235198 0.194863 0.222493 0.237353 0.269186 0.222180 0.189992 0.228348 0.247133 0.189447 0.222875 0.282684 0.277281 0.290743 0.288418
chargesum: 0.00000
title: Mulliken charges with hydrogens summed into heavy atoms:
elementType: O O O O N N C C C C C C C C C C C C C C C
charge: -0.294218 -0.243440 -0.201489 -0.203292 -0.100128 0.027136 0.417290 -0.100156 -0.082860 -0.007180 -0.051251 0.143328 0.026589 0.030072 0.218384 0.229600 -0.039042 -0.036435 -0.062622 -0.058138 0.387852
polarizability: 2.74728472e+02 -1.62781187e+01 1.39362829e+02 7.37789140e+00 -4.91919305e+00 1.83408800e+02
1716.lowfreq: -4.6782 -0.7316 -0.0012 -0.0011 -0.0009 10.4611 17.3636 18.9636 39.4296
frequency: 16.7773 18.4648 39.4124 42.4218 54.7176 64.6441 81.1638 95.5670 126.8413 143.9097 147.9263 180.5937 212.7397 221.8275 234.7890 236.9299 263.8533 277.8891 284.9380 317.3068 337.3000 357.5312 372.6738 410.2711 431.4700 458.4160 459.9540 487.0014 499.2920 534.5496 623.5715 652.3706 666.2897 677.7026 685.2673 738.8076 764.4242 779.8153 790.1039 816.7680 829.1076 860.4881 863.5590 870.9949 888.6124 893.9832 924.2454 951.8980 957.1085 974.1805 1003.0581 1005.4709 1012.0157 1030.7074 1036.6332 1041.6382 1064.4584 1076.2551 1089.7847 1090.0577 1107.6616 1127.5210 1147.5518 1173.3928 1173.8398 1187.6468 1203.5403 1214.5378 1229.2853 1231.9053 1245.7304 1249.8762 1253.1455 1265.9040 1291.2206 1300.1356 1316.2780 1355.6925 1366.8143 1367.6178 1405.2145 1414.2691 1418.3785 1436.1327 1440.3784 1454.3024 1459.0175 1462.2083 1464.8436 1472.3414 1474.2885 1477.7131 1481.6975 1487.6622 1588.6720 1609.1030 1618.9621 2831.8715 2850.4874 2867.0377 3002.4240 3006.7486 3008.1294 3019.0455 3019.7039 3025.7685 3031.0555 3069.8648 3078.2992 3079.7486 3082.4255 3090.6203 3101.5710 3164.5291 3174.5384 3187.9720 3192.5114
redmass: 4.7096 5.0021 3.1395 8.2285 4.1028 6.7137 7.7847 3.0872 3.1510 4.0688 3.7156 2.4799 2.5139 2.5530 1.4213 1.4900 5.3828 4.3481 3.5277 2.5165 2.8033 3.7647 1.9600 2.8857 2.2024 3.8591 3.0230 8.2701 5.3375 5.1062 7.1271 6.1130 2.6575 3.7845 3.8581 2.6861 5.0570 2.6426 2.3043 2.8917 3.6657 2.3876 1.2526 2.3507 1.6662 3.4991 2.4632 2.4790 1.7863 2.4868 1.3554 3.2403 1.3656 1.7273 1.4701 1.4446 3.0104 3.4167 2.1325 1.6699 1.3510 1.5048 1.9234 1.3646 1.2358 1.6082 1.9337 6.1764 1.2760 1.2588 3.2511 1.4839 1.9393 2.6095 1.2618 1.7325 1.6193 1.4712 6.2054 1.6288 8.5399 4.4488 1.1405 1.1295 1.0865 1.0860 1.0850 1.0688 1.0751 1.0695 2.4407 1.0761 1.0899 1.0575 9.1208 6.4589 10.3072 1.0704 1.0570 1.0573 1.0587 1.0579 1.0598 1.0824 1.0767 1.0634 1.0727 1.1063 1.1011 1.1056 1.1063 1.0999 1.1067 1.0901 1.0890 1.0957 1.0973
irintensity: 0.1320 0.0068 0.2862 0.0266 0.1919 0.5082 3.0821 0.2317 1.0790 1.1948 0.8621 5.0625 2.8007 4.7034 1.7650 1.7772 0.3732 2.9139 0.6546 3.9028 15.9507 10.8924 1.5441 0.0028 2.8301 0.4838 1.6700 8.1972 1.1600 0.3429 0.3325 0.0211 2.9817 1.9859 57.5092 12.1953 3.8929 30.1680 5.7364 21.7847 2.3247 2.0971 0.9995 0.4426 51.6623 17.1914 47.8559 5.9443 2.2511 0.1060 1.0195 33.5032 0.0073 34.2110 18.2015 19.9520 82.5730 210.7264 21.9427 3.9666 11.6085 5.3901 7.6171 3.3375 4.1542 6.9166 43.1068 497.0756 3.4326 10.1441 147.6279 6.1627 54.8893 4.9573 0.5382 5.4530 1.8242 4.8767 82.4616 11.0757 8.1001 63.3116 3.3597 10.0236 9.4505 9.0642 8.5956 11.8324 7.5958 20.5135 3.0734 3.4758 8.7666 19.0340 56.9897 6.7257 120.4639 64.8483 77.2088 239.3387 48.6595 25.0204 10.0567 19.2836 58.8450 44.9610 33.2436 15.0541 36.0276 5.9656 12.5312 36.4287 73.9488 1.3316 1.1778 0.2394 0.8929
temp: 298.150 k
press: 1.00000 atm
elementType: 8 8 8 8 7 7 6 6 6 6 6 6 6 6 6 6 6 6 6 6 6 1 1 1 1 1 1 1 1 1 1 1 1 1 1 1 1 1 1 1 1
symmnumber: 1
zpe: 866870.2 jmol-1
zpe.correction: 0.330173 hartree
zpe.thermalcorrener: 0.351218 hartree
zpe.thermalcorrenthalpy: 0.352162 hartree
zpe.thermalcorrgfe: 0.277296 hartree
zpe.sumelectzpe: -992.285375 hartree
zpe.sumelectthermal: -992.264330 hartree
zpe.sumelectthermalent: -992.263386 hartree
zpe.sumelectthermalfe: -992.338252 hartree
dipole: 6.1762 0.1236 -0.9654
dipole: 6.2524
quadrupole: -148.5444 -121.2087 -129.2915
quadrupole: 4.8251 -10.9381 1.7772
quadrupole: -15.5295 11.8062 3.7234 4.8251 -10.9381 1.7772
hfenergy: -992.615548 hartree
pointgroup: C01 [X(C15H20N2O4)]
dipole: -2.427352 -0.083222 -0.3899987 debye
polarizability: 272.9616207|-23.4893091|150.4566936|2.1725421|18.1806285|174.0817861 unknown
InChI: InChI=1S/C15H20N2O4/c1-16(2)10-15(8-3-9-15)11-21-14(18)12-4-6-13(7-5-12)17(19)20/h4-7H,3,8-11H2,1-2H3
charge 0 multiplicity 1
41 atoms
O  -0.97804 0.704433 0.013361
O  -0.262963 1.690759 2.001907
O  6.25028 -0.502537 0.407932
O  5.459524 -1.419545 -1.524979
N  -3.438708 -1.616816 0.762475
N  5.297532 -0.772107 -0.419921
C  -3.296014 0.460663 -0.711347
C  -4.698983 1.19341 -0.738234
C  -3.043151 1.013493 -2.165337
C  -4.230085 2.020529 -1.98286
C  -3.26112 -1.081599 -0.605762
C  -2.386296 1.10583 0.333399
C  -2.906379 -2.987096 0.908626
C  -4.820432 -1.504202 1.27161
C  -0.015903 1.046605 0.952501
C  1.347248 0.560616 0.56078
C  2.42689 0.837926 1.438802
C  1.573298 -0.155919 -0.643224
C  3.727271 0.4039 1.124674
C  2.869493 -0.595489 -0.971057
C  3.926162 -0.308014 -0.079038
H  -5.513591 0.49097 -0.987563
H  -4.98592 1.761646 0.16423
H  -2.041778 1.432012 -2.357996
H  -3.261948 0.24742 -2.931758
H  -3.888181 3.035164 -1.714652
H  -4.94388 2.102659 -2.818039
H  -4.01872 -1.498491 -1.320756
H  -2.266452 -1.41207 -0.962357
H  -2.435176 2.210156 0.314917
H  -2.620381 0.735771 1.346685
H  -2.976133 -3.300457 1.965933
H  -3.450281 -3.74544 0.290146
H  -1.841475 -3.006618 0.616861
H  -5.140309 -0.449272 1.289919
H  -5.561486 -2.078874 0.658633
H  -4.863029 -1.887306 2.306742
H  2.222301 1.392971 2.359496
H  0.730758 -0.358028 -1.309002
H  4.578401 0.600783 1.781141
H  3.077557 -1.148737 -1.890288
