program: Gaussian 09
title: 000299070
version: EM64L-G09RevD.01
frameworkgroup: C1[X(C10H13NO2S)]
method: RPBEPBE
basis: SDD
operation: Freq
keyword: #p
keyword: freq=noraman
keyword: PBEPBE/SDD
title: #p freq=noraman PBEPBE/SDD
converged: YES YES NO NO
title: Mulliken charges:
elementType: S O O N C C C C C C C C C C H H H H H H H H H H H H H
charge: 0.017473 -0.314968 -0.278032 -0.032881 0.292832 0.194672 -0.297779 -0.326131 -0.205584 -0.234598 -0.214665 -0.645746 -0.607010 -0.511666 0.247028 0.252224 0.228980 0.229263 0.236249 0.288212 0.234613 0.264125 0.263108 0.218256 0.241923 0.230183 0.229919
chargesum: 0.00000
title: Mulliken charges with hydrogens summed into heavy atoms:
elementType: S O O N C C C C C C C C C C
charge: 0.017473 -0.314968 -0.278032 -0.032881 0.292832 0.194672 -0.050751 -0.073907 -0.205584 -0.005618 0.014598 0.113329 0.138479 0.190359
polarizability: 1.79318088e+02 -1.04306891e+01 1.32217209e+02 9.62499469e+00 -3.90183821e-01 1.06275162e+02
1716.lowfreq: -13.0563 -0.0022 -0.0019 -0.0017 1.9041 11.2988 16.7071 35.0848 47.2132
frequency: 14.7033 34.9830 47.1826 63.5755 88.1757 107.8063 130.0207 164.9815 194.3156 220.5545 240.1322 257.1702 279.2830 303.7094 358.3950 414.7228 439.8578 457.0760 501.1097 528.1965 571.8969 576.4920 614.9293 639.9512 712.3250 730.0722 757.5165 822.6434 846.2279 927.3077 932.2582 967.7187 971.7343 1033.4127 1050.6919 1067.3188 1083.7290 1091.0681 1110.9241 1137.8367 1154.2646 1157.6482 1163.1469 1168.3496 1238.2330 1254.8252 1262.0103 1380.2752 1398.4914 1424.4479 1426.4212 1445.5001 1449.6630 1461.1200 1463.2220 1477.1936 1479.0093 1479.9474 1487.5434 1521.2031 1585.3742 1608.9633 2976.9006 2977.8862 2990.2304 3053.5448 3076.1228 3082.4150 3108.0695 3115.0777 3136.8953 3149.6241 3151.9288 3164.2278 3175.7820
redmass: 1.1327 5.2115 4.1435 3.5573 4.1155 2.7627 1.1740 3.7516 4.8962 1.3581 2.7116 2.4898 4.8968 4.0684 5.6141 3.4506 3.6543 4.7723 4.2209 4.7732 4.7436 9.2968 6.6834 6.8929 4.1726 5.2736 1.3114 5.7648 1.4459 3.3710 1.4413 7.5358 1.3406 2.0290 1.5599 7.0580 2.4882 1.2294 1.2407 1.3655 1.3352 1.6900 1.2497 1.8322 3.0808 3.0286 1.9917 8.6450 1.8648 1.5474 1.1380 1.6983 1.0445 1.0664 1.1333 1.4425 1.0769 1.4205 1.0465 1.9029 7.4982 6.7178 1.0311 1.0370 1.0341 1.1019 1.1011 1.1040 1.1019 1.1033 1.0854 1.0901 1.0961 1.0949 1.1006
irintensity: 0.1224 3.2279 1.1908 1.2139 9.7377 0.3474 0.0839 3.0487 1.6633 1.2813 8.2328 0.1394 0.1351 6.0748 2.6246 2.4163 3.2924 10.4613 0.8792 0.3312 8.0282 0.2391 3.0252 6.3182 2.8025 11.3504 85.0806 17.7980 5.5856 2.0686 0.6290 42.7941 1.2846 13.9285 156.9997 176.6658 81.0639 1.3873 4.3265 0.9219 4.2611 42.0858 52.8424 76.0947 155.0874 64.2595 21.8122 38.2970 87.1885 19.5222 11.7657 12.3595 18.6355 23.7505 7.7175 108.5505 15.9263 51.3078 13.7876 217.6977 10.2558 26.3311 51.2451 52.1194 58.9884 28.3954 15.8700 30.9936 20.0998 28.2860 1.5791 14.6917 2.1306 14.4066 12.8879
temp: 298.150 k
press: 1.00000 atm
elementType: 16 8 8 7 6 6 6 6 6 6 6 6 6 6 1 1 1 1 1 1 1 1 1 1 1 1 1
symmnumber: 1
zpe: 557086.3 jmol-1
zpe.correction: 0.212183 hartree
zpe.thermalcorrener: 0.227410 hartree
zpe.thermalcorrenthalpy: 0.228354 hartree
zpe.thermalcorrgfe: 0.167362 hartree
zpe.sumelectzpe: -991.039224 hartree
zpe.sumelectthermal: -991.023998 hartree
zpe.sumelectthermalent: -991.023053 hartree
zpe.sumelectthermalfe: -991.084045 hartree
dipole: -3.2478 0.4312 -2.5427
dipole: 4.1473
quadrupole: -72.8626 -86.5551 -94.6964
quadrupole: -5.7946 7.2251 4.8953
quadrupole: 11.8421 -1.8504 -9.9917 -5.7946 7.2251 4.8953
hfenergy: -991.2514071 hartree
pointgroup: C01 [X(C10H13N1O2S1)]
dipole: -1.276671 0.2037965 -0.9954392 debye
polarizability: 178.9152107|-11.4738272|132.67809|9.3326333|-0.3569621|106.2171593 unknown
InChI: InChI=1S/C10H13NO2S/c1-11(2)10(14)13-9-7-5-4-6-8(9)12-3/h4-7H,1-3H3
charge 0 multiplicity 1
27 atoms
S  -1.39542 -0.692349 1.765241
O  -0.531589 0.244853 -0.686358
O  1.547693 2.218375 0.106255
N  -2.799556 0.056604 -0.465155
C  0.812841 -0.141344 -0.38024
C  1.780166 0.850894 -0.068477
C  1.183097 -1.493181 -0.536228
C  3.138443 0.450924 0.037062
C  -1.59831 -0.135473 0.164086
C  2.53176 -1.879177 -0.409656
C  3.512684 -0.894763 -0.133498
C  -2.931473 0.49644 -1.870803
C  -4.044548 -0.208998 0.282365
C  0.245419 2.682556 0.623823
H  0.403639 -2.22752 -0.763615
H  3.875351 1.226479 0.267299
H  2.814643 -2.929421 -0.531353
H  4.566638 -1.178071 -0.041458
H  -3.514993 -0.247166 -2.444961
H  -1.936077 0.599723 -2.320251
H  -3.45377 1.470501 -1.920153
H  -4.06924 0.379399 1.215943
H  -4.114271 -1.275724 0.561176
H  -4.901586 0.065393 -0.353968
H  -0.114099 2.027068 1.438495
H  -0.506838 2.725348 -0.182113
H  0.445594 3.694528 1.00914
