program: Gaussian 09
title: 000299076
version: EM64L-G09RevD.01
frameworkgroup: C1[X(C12H19N3O)]
method: RPBEPBE
basis: SDD
operation: Freq
keyword: #p
keyword: freq=noraman
keyword: PBEPBE/SDD
title: #p freq=noraman PBEPBE/SDD
converged: YES YES NO NO
title: Mulliken charges:
elementType: O N N N C C C C C C C C C C C C H H H H H H H H H H H H H H H H H H H
charge: -0.257076 0.070843 -0.410259 -0.652090 0.263659 -0.519386 -0.536178 -0.464853 -0.422089 0.397920 0.003377 -0.566127 -0.408399 -0.423726 -0.852470 0.289600 0.208158 0.262082 0.219712 0.224355 0.213474 0.261864 0.213915 0.201588 0.196034 0.246430 0.214160 0.221713 0.216301 0.227476 0.234271 0.228105 0.258578 0.341597 0.297441
chargesum: 0.00000
title: Mulliken charges with hydrogens summed into heavy atoms:
elementType: O N N N C C C C C C C C C C C C
charge: -0.257076 0.070843 -0.151682 -0.013053 0.263659 -0.049146 -0.092111 0.010485 -0.006585 0.397920 0.003377 -0.123664 0.027475 -0.207425 -0.162618 0.289600
polarizability: 1.93189976e+02 -5.16514672e-02 1.65200024e+02 3.26107747e-01 7.41735994e+00 1.08663584e+02
1716.lowfreq: -5.2362 -0.0001 0.0005 0.0007 3.1768 8.8429 29.4726 37.8691 53.9984
frequency: 29.2444 37.8419 53.6609 85.9453 93.9946 136.3192 190.0648 199.6244 213.4593 231.2425 261.6031 263.0142 277.1104 290.8459 319.4147 369.4073 380.9198 432.7781 466.3312 479.8706 507.5367 531.3444 541.8554 555.1754 596.9817 603.2556 628.0165 676.6087 709.2038 710.9406 789.9084 798.7800 826.2295 840.7098 853.5976 904.4305 909.4926 921.1108 941.8623 958.8300 996.1088 1010.7421 1014.8450 1039.5091 1043.1204 1054.1761 1057.8834 1079.3952 1087.3442 1097.0784 1135.4195 1150.9127 1165.1940 1194.4239 1203.6966 1220.6323 1237.0491 1270.1134 1291.1116 1292.0022 1296.0152 1303.0139 1313.5479 1319.5326 1340.9325 1346.4265 1396.2383 1449.5126 1458.9392 1462.7873 1465.0860 1467.5758 1472.2009 1479.0298 1484.9866 1495.4911 1600.5420 1618.1812 1674.0232 1678.6687 2959.1455 2969.1540 2979.6252 2981.8249 2995.2576 3010.7066 3011.8342 3017.6620 3033.8472 3041.8297 3043.7723 3059.4007 3077.1827 3078.4681 3096.8739 3099.8656 3410.0665 3537.6354 3696.3043
redmass: 4.5221 3.5592 3.0287 3.0573 4.9455 4.4924 1.3090 2.2929 1.9572 2.2550 1.8222 2.6004 2.7008 2.0880 2.5601 3.0531 2.8302 2.8517 2.6045 1.2163 3.3762 1.5370 2.0850 2.8907 2.9195 4.4919 3.5656 3.4085 8.4091 2.3382 1.8389 1.4105 1.9701 1.9914 1.8271 2.5637 2.5914 2.4298 2.2610 1.9154 2.0815 1.9829 1.7602 2.3817 1.6532 1.9518 1.7819 2.7770 1.5892 2.4333 2.9592 1.4381 1.5147 1.5969 2.2864 1.3232 1.3834 1.4163 1.8704 1.7065 1.6661 1.3157 1.4569 1.4000 1.4609 1.8075 1.2247 1.1040 1.1939 1.0816 1.1486 1.0718 1.0812 1.0637 1.1120 1.4411 1.2370 8.6507 6.9016 5.4406 1.0623 1.0370 1.0609 1.0611 1.0629 1.0616 1.0952 1.0645 1.1018 1.0983 1.0965 1.1036 1.0986 1.1021 1.1022 1.0907 1.0744 1.0458 1.1034
irintensity: 5.6559 11.8775 1.7984 3.2693 3.7120 2.6286 0.8091 0.2637 1.5715 1.9225 10.0148 4.2932 0.8856 4.3658 1.3957 2.4246 77.0362 0.8051 41.0296 195.9131 8.5760 60.4417 14.6033 5.1929 16.0606 2.3622 3.1831 13.5968 18.7022 0.3975 1.6456 20.6350 5.0488 0.3677 7.1392 7.4679 0.9763 6.1724 9.3469 10.4378 2.7502 1.6624 0.0772 31.0372 8.0218 2.8798 0.0021 43.6317 7.5909 57.6600 22.0572 14.1548 19.5923 3.8451 27.3310 0.7987 1.5925 1.0193 231.6768 117.0049 17.5850 4.7587 6.5761 2.2271 5.4523 2.2940 15.7030 36.7632 79.6953 14.5536 42.3278 2.1248 14.3517 8.2138 20.0093 266.0348 138.0708 1.4303 45.9147 251.2824 43.4555 34.3744 21.0201 42.2401 41.4496 40.4919 38.8365 32.6730 53.5218 16.5799 30.6051 38.7466 26.3030 40.7495 25.9408 47.7037 26.3296 42.1977 41.0925
temp: 298.150 k
press: 1.00000 atm
elementType: 8 7 7 7 6 6 6 6 6 6 6 6 6 6 6 6 1 1 1 1 1 1 1 1 1 1 1 1 1 1 1 1 1 1 1
symmnumber: 1
zpe: 780458.7 jmol-1
zpe.correction: 0.297261 hartree
zpe.thermalcorrener: 0.313494 hartree
zpe.thermalcorrenthalpy: 0.314438 hartree
zpe.thermalcorrgfe: 0.253237 hartree
zpe.sumelectzpe: -706.892937 hartree
zpe.sumelectthermal: -706.876704 hartree
zpe.sumelectthermalent: -706.875759 hartree
zpe.sumelectthermalfe: -706.936960 hartree
dipole: 0.3203 5.1921 2.2805
dipole: 5.6800
quadrupole: -83.2253 -94.0281 -98.3625
quadrupole: -17.1288 -6.3418 0.1931
quadrupole: 8.6467 -2.1561 -6.4905 -17.1288 -6.3418 0.1931
hfenergy: -707.1901977 hartree
pointgroup: C01 [X(C12H19N3O1)]
dipole: 0.0961184 -2.000843 0.990517 debye
polarizability: 192.7224364|3.5671614|164.8176605|2.5142073|-9.8322802|109.5134877 unknown
InChI: InChI=1S/C12H19N3O/c1-9-5-4-6-10(14-15-11(13)16)12(9)7-2-3-8-12/h5,15H,2-4,6-8,13H2,1H3
charge 0 multiplicity 1
35 atoms
O  3.423251 1.773804 -0.652847
N  1.130539 0.255041 -0.054962
N  2.41429 -0.170504 0.251198
N  4.742449 0.02265 0.144854
C  -1.309219 0.100982 -0.001695
C  -1.227824 1.262023 -1.051259
C  -1.923857 0.814213 1.293539
C  -1.052061 2.550223 -0.216542
C  -2.02647 2.333857 0.968117
C  -2.206071 -1.072901 -0.45411
C  0.089941 -0.432571 0.35584
C  0.098866 -1.731141 1.147473
C  -0.526302 -2.851157 0.275641
C  -1.833248 -2.379016 -0.330782
C  -3.565156 -0.725276 -1.042479
C  3.512967 0.632541 -0.132993
H  -2.175661 1.322185 -1.616263
H  -0.4031 1.102926 -1.76353
H  -1.255617 0.645568 2.158557
H  -2.903958 0.377541 1.558672
H  -1.280355 3.463673 -0.794887
H  -0.007537 2.618777 0.133898
H  -1.786752 2.965255 1.842926
H  -3.058328 2.584576 0.652508
H  1.102126 -2.032987 1.504901
H  -0.529885 -1.599665 2.049526
H  -0.700428 -3.755249 0.89206
H  0.185215 -3.149732 -0.522658
H  -2.524179 -3.160638 -0.676909
H  -4.215874 -1.616079 -1.08293
H  -3.478195 -0.329202 -2.072147
H  -4.08281 0.050561 -0.44634
H  2.580717 -1.035429 0.781379
H  5.574157 0.562808 -0.078749
H  4.848171 -0.94446 0.444393
