program: Gaussian 09
title: 000299069
version: EM64L-G09RevD.01
frameworkgroup: C1[X(C10H13NO2S)]
method: RPBEPBE
basis: SDD
operation: Freq
keyword: #p
keyword: freq=noraman
keyword: PBEPBE/SDD
title: #p freq=noraman PBEPBE/SDD
converged: YES YES NO NO
title: Mulliken charges:
elementType: S O O N C C C C C C C C C C H H H H H H H H H H H H H
charge: 0.141848 -0.258290 -0.226848 -0.107716 -0.293705 0.361281 -0.148878 -0.344838 0.017904 -0.263432 -0.228076 -0.608171 -0.619225 -0.536981 0.265095 0.240067 0.229141 0.223992 0.225689 0.264143 0.240797 0.278062 0.231362 0.227998 0.222711 0.220748 0.245322
chargesum: 0.00000
title: Mulliken charges with hydrogens summed into heavy atoms:
elementType: S O O N C C C C C C C C C C
charge: 0.141848 -0.258290 -0.226848 -0.107716 -0.293705 0.361281 0.116217 -0.104771 0.017904 -0.034290 -0.004084 0.122457 0.118197 0.151801
polarizability: 2.00858165e+02 1.01410425e+01 1.49571259e+02 -5.99543689e+00 -1.89973026e+00 8.39896934e+01
1716.lowfreq: 0.0005 0.0008 0.0015 6.0779 10.4005 10.8788 26.7931 35.1979 73.4199
frequency: 26.6724 35.0442 73.4062 98.0608 104.2710 106.5781 129.1871 160.0697 168.5566 225.6890 236.6185 243.0379 280.9498 287.4868 346.3644 401.3899 414.0326 441.3138 464.1633 497.5036 541.5218 558.6192 604.5500 651.0990 665.3898 723.6606 750.0568 768.6805 838.1956 879.6325 927.5534 969.1973 985.8754 1023.4157 1047.6380 1058.7078 1078.1095 1092.8663 1111.7298 1126.4880 1138.2513 1158.0290 1175.1839 1229.3221 1239.7162 1269.0627 1346.7399 1377.6329 1419.0872 1421.0001 1439.7628 1443.3360 1463.4424 1468.6837 1470.8730 1476.6997 1478.3526 1485.7238 1493.5875 1580.4941 1595.3477 1642.3917 2959.5032 2969.2898 2974.6383 3048.0687 3049.1053 3056.3617 3099.2933 3125.1140 3125.9745 3132.2564 3153.8920 3167.7870 3183.2415
redmass: 5.0574 3.9610 4.2515 3.3061 1.3383 3.6858 1.0816 3.4659 5.5061 2.7863 2.0327 2.0796 3.5333 2.5464 4.3503 5.7398 4.3998 3.6405 5.1581 5.1050 3.8925 5.5693 11.4119 5.9846 6.2961 3.0514 1.3510 5.9342 1.4536 5.0253 1.3800 1.3248 8.4990 6.3315 2.1001 1.4184 2.0231 1.2302 1.2589 1.5628 1.3800 1.3414 1.0774 3.3771 5.4908 1.4400 3.2036 10.0031 1.1792 1.6932 1.3948 1.1649 1.6599 1.0691 1.0512 1.0587 1.2319 1.0500 1.1154 6.5044 6.5238 8.8834 1.0329 1.0365 1.0369 1.1040 1.1020 1.0986 1.0995 1.0992 1.0975 1.0861 1.0908 1.0951 1.0974
irintensity: 1.7913 4.1042 2.8737 7.1962 0.1248 3.1911 0.3063 0.4638 1.6137 0.1352 1.9675 4.3040 1.9214 0.4739 32.6565 3.0961 0.5613 2.4699 5.2898 4.3731 0.9951 5.2331 7.0290 45.5098 2.2596 5.2205 92.0640 9.3735 1.9750 40.0947 1.1946 0.2776 35.8666 104.2352 37.0043 12.8168 266.9274 4.3273 0.2444 15.1404 1.7929 0.2307 3.9329 133.8565 44.3819 18.6432 133.1516 7.4347 48.5051 18.2945 7.3869 5.0584 119.8156 16.1366 14.0693 18.3779 0.1621 26.3453 23.5455 4.6533 47.3939 227.0519 74.2539 32.6576 113.4416 42.8452 47.7459 21.6571 13.8157 21.5005 2.3535 2.9856 18.7556 22.6988 6.4868
temp: 298.150 k
press: 1.00000 atm
elementType: 16 8 8 7 6 6 6 6 6 6 6 6 6 6 1 1 1 1 1 1 1 1 1 1 1 1 1
symmnumber: 1
zpe: 556267.3 jmol-1
zpe.correction: 0.211871 hartree
zpe.thermalcorrener: 0.227194 hartree
zpe.thermalcorrenthalpy: 0.228138 hartree
zpe.thermalcorrgfe: 0.168007 hartree
zpe.sumelectzpe: -991.052050 hartree
zpe.sumelectthermal: -991.036727 hartree
zpe.sumelectthermalent: -991.035783 hartree
zpe.sumelectthermalfe: -991.095914 hartree
dipole: 0.6942 2.3647 0.2858
dipole: 2.4810
quadrupole: -59.8828 -84.2253 -94.0771
quadrupole: 0.0049 -4.0289 4.4324
quadrupole: 19.5123 -4.8302 -14.6821 0.0049 -4.0289 4.4324
hfenergy: -991.2639211 hartree
pointgroup: C01 [X(C10H13N1O2S1)]
dipole: 0.4490425 0.8623631 -0.0862494 debye
polarizability: 202.876184|-1.6970876|143.9075585|-5.074191|-14.9879477|87.6353752 unknown
InChI: InChI=1S/C10H13NO2S/c1-11(2)10(12)14-9-7-5-4-6-8(9)13-3/h4-7H,1-3H3
charge 0 multiplicity 1
27 atoms
S  1.015203 0.285205 -1.10757
O  -1.175266 2.186221 -0.553823
O  1.548354 -1.48307 0.993276
N  3.397992 -0.345453 0.125164
C  -0.680407 -0.166119 -0.569669
C  -1.6305 0.875479 -0.360946
C  -1.068235 -1.511682 -0.407574
C  -2.958319 0.547108 0.012549
C  2.053142 -0.657414 0.192591
C  -2.390337 -1.837121 -0.026448
C  -3.330064 -0.805584 0.180613
C  3.988582 0.633666 -0.801587
C  4.338489 -1.092401 0.984578
C  -2.125235 3.277173 -0.326005
H  -0.329023 -2.300778 -0.564165
H  -3.699582 1.335223 0.173537
H  -2.676345 -2.885478 0.104203
H  -4.358909 -1.047124 0.470326
H  4.844921 1.124006 -0.305038
H  3.255346 1.412526 -1.065295
H  4.34909 0.153943 -1.732502
H  3.770226 -1.818104 1.584695
H  4.872173 -0.39993 1.662641
H  5.082033 -1.630618 0.366145
H  -2.493756 3.280272 0.718308
H  -2.983523 3.217544 -1.023482
H  -1.55285 4.196011 -0.52032
