program: Gaussian 09
title: 000299066
version: EM64L-G09RevD.01
frameworkgroup: C1[X(C9H10N2O3S)]
method: RPBEPBE
basis: SDD
operation: Freq
keyword: #p
keyword: freq=noraman
keyword: PBEPBE/SDD
title: #p freq=noraman PBEPBE/SDD
converged: NO YES NO NO
title: Mulliken charges:
elementType: S O O O N N C C C C C C C C C H H H H H H H H H H
charge: 0.124515 -0.219399 -0.213410 -0.210764 -0.100526 0.023307 -0.154634 0.382554 -0.224538 -0.113666 -0.340344 -0.362997 0.029926 -0.620812 -0.629630 0.258863 0.281090 0.288223 0.287768 0.237807 0.259464 0.258142 0.280754 0.239789 0.238519
chargesum: 0.00000
title: Mulliken charges with hydrogens summed into heavy atoms:
elementType: S O O O N N C C C C C C C C C
charge: 0.124515 -0.219399 -0.213410 -0.210764 -0.100526 0.023307 -0.154634 0.382554 0.034324 0.167424 -0.052121 -0.075230 0.029926 0.134602 0.129431
polarizability: 2.64117780e+02 4.14599255e+00 1.34808492e+02 6.91479129e+00 -9.70126257e+00 7.39419504e+01
1716.lowfreq: -67.4571 -6.0478 -0.0011 -0.0010 -0.0003 2.0506 9.3158 24.5374 30.7923
frequency: -67.4527 24.4857 30.7447 57.9579 75.0452 111.1772 119.0506 131.2797 182.6876 190.1484 245.9143 267.1851 292.9807 330.9263 361.6152 400.1319 408.0557 446.4201 480.0776 506.8939 525.8996 605.3042 621.1396 651.3027 662.4035 692.3467 725.5902 788.8105 835.2524 851.2161 870.7417 977.9271 985.0207 999.4434 1054.6801 1062.3212 1086.1114 1090.8767 1092.1855 1108.8273 1134.0385 1181.1865 1221.4063 1243.5520 1291.7263 1336.6902 1356.4947 1393.2623 1406.2374 1424.4703 1443.9572 1460.0975 1470.0304 1478.8429 1486.3809 1488.1963 1587.4282 1588.4503 1662.8401 2980.6619 2985.4617 3064.6989 3066.1311 3110.3871 3129.1457 3156.4962 3179.6615 3187.4120 3202.1688
redmass: 1.0907 6.0274 4.5631 8.3567 5.6850 3.6879 5.6466 1.1812 7.3143 5.9427 2.8781 6.2022 6.1686 7.4774 5.2248 4.6356 2.9017 4.3272 4.3237 7.6796 7.7239 11.1348 7.1669 6.0001 4.7203 8.8026 4.5912 9.4027 1.2685 1.5566 4.9687 1.3497 1.3668 3.8113 1.5580 2.5301 2.2071 1.2318 3.0866 1.3103 1.3516 1.3826 5.0616 4.9646 1.2569 3.3070 6.2441 9.8638 4.2098 1.1507 1.1770 2.1661 1.0419 1.0618 1.0524 1.0865 6.3361 7.9227 9.3047 1.0347 1.0359 1.1027 1.1022 1.0993 1.0985 1.0903 1.0899 1.0955 1.0963
irintensity: 0.2570 0.7116 2.6574 0.2886 1.0708 1.2293 5.6280 0.2451 3.3237 0.6611 4.6213 6.1994 2.7475 10.0430 25.1509 4.8277 2.4453 4.2778 12.0331 2.3293 13.8583 13.8140 1.3465 61.0356 21.6938 2.2527 8.3542 42.8642 2.5374 54.8192 54.9475 5.8817 0.2041 28.4277 72.2016 228.5605 161.3539 3.1359 12.0335 15.9703 0.2844 86.5102 391.8267 30.3644 1.0585 142.6744 66.0860 31.9363 59.8212 31.9289 9.4306 23.3968 25.6040 5.7858 17.8118 81.0465 83.1474 6.4697 258.6496 37.5925 60.3595 26.8814 21.4804 19.7016 2.0309 2.2470 1.1608 1.6681 0.5086
temp: 298.150 k
press: 1.00000 atm
elementType: 16 8 8 8 7 7 6 6 6 6 6 6 6 6 6 1 1 1 1 1 1 1 1 1 1
symmnumber: 1
zpe: 476518.6 jmol-1
zpe.correction: 0.181496 hartree
zpe.thermalcorrener: 0.196110 hartree
zpe.thermalcorrenthalpy: 0.197054 hartree
zpe.thermalcorrgfe: 0.137569 hartree
zpe.sumelectzpe: -1081.007446 hartree
zpe.sumelectthermal: -1080.992832 hartree
zpe.sumelectthermalent: -1080.991888 hartree
zpe.sumelectthermalfe: -1081.051373 hartree
dipole: -9.1873 -2.0756 -0.5540
dipole: 9.4351
quadrupole: -96.5034 -93.1134 -95.4422
quadrupole: -3.4405 -1.3980 -2.8879
quadrupole: -1.4837 1.9062 -0.4225 -3.4405 -1.3980 -2.8879
hfenergy: -1081.1889419 hartree
pointgroup: C01 [X(C9H10N2O3S1)]
dipole: 3.6191222 0.6338338 -0.5287177 debye
dipolederiv: -0.8928936 0.20642 -0.0662941 0.6126977 -0.3288191 0.09877 -0.0927634 0.1362397 -0.1867393 -0.8412455 -0.1309233 0.1159655 0.0397883 -0.86487 0.3619615 -0.0314652 0.3492338 -0.4965435 -0.9093522 0.1746668 0.1307899 0.2946016 -0.592325 -0.1054279 0.1738463 -0.0939696 -0.275914 -0.7627102 -0.2021487 0.0434356 -0.3753968 -0.7202059 -0.0355043 0.0362631 -0.0467549 -0.2458341 -1.6002031 0.0325189 0.0235944 0.2488842 -0.4865581 0.1183744 -0.1331799 0.1061832 -0.3670445 2.1378541 0.1131405 -0.2740107 0.2037811 1.0783546 0.1255088 -0.328397 0.1338293 0.2617721 1.2268598 -0.0084078 -0.11199 0.2087768 0.0337026 0.0845861 -0.2195694 0.0711174 -0.0239869 -0.9581071 -0.0944405 0.1218952 -0.1797808 0.0278421 0.0114103 0.1619112 0.0170749 0.0302043 -0.6195607 0.1646314 0.0603318 0.1488839 0.0716188 -0.0026246 0.0166637 -0.00432 -0.1120352 -0.428786 -0.2166449 -0.0023938 -0.3875306 -0.0627401 0.0585315 0.1719222 0.0055464 -0.0785575 0.2802343 -0.0856818 -0.0709875 0.333446 -0.0295232 -0.0302934 -0.0276189 0.0226947 -0.0926992 0.3128685 0.1656222 -0.0422584 -0.2040371 -0.0229038 0.0446099 -0.1164209 -0.0367367 -0.0858437 2.2145692 -0.1035202 0.0001314 -0.8712075 1.015118 -0.5091653 0.2434074 -0.4996977 0.4935041 0.1322296 0.0929884 -0.0572211 0.272662 0.2611535 -0.0437574 -0.1702709 -0.0365378 0.2605455 0.2521626 -0.1689886 0.0914813 -0.4167823 0.2415225 0.0096156 0.2770447 0.000472 0.2387656 0.0769023 -0.0786396 0.0105338 -0.0663763 -0.0044462 -0.0306044 0.0029909 -0.0129754 0.1438619 0.0915237 0.0554309 0.0399876 0.046016 0.0535777 -0.0275957 0.0464575 -0.0003289 0.12665 0.0790809 0.0620043 0.0246756 0.0142846 0.0766607 -0.0216657 0.0321352 -0.0241258 0.164221 0.0884008 -0.0475305 -0.0004504 -0.0121966 0.05359 -0.0197428 -0.0036242 -0.0083433 0.1693552 -0.1541287 -0.0064823 -0.0038372 0.0739394 0.1103975 0.0136906 -0.0539944 0.0116053 0.1153596 0.1414533 0.0779368 0.0390051 -0.0128413 -0.0766099 -0.0333143 0.071719 -0.0527018 0.0257572 0.1378807 -0.0040879 -0.0730584 -0.0728198 0.0370272 0.007138 0.0009006 0.0345568 -0.1090369 0.1456915 -0.121391 0.0648535 -0.0264901 0.0427654 0.0497665 0.0151155 0.0486094 0.1048695 -0.0728516 0.0151114 -0.1163607 -0.0159354 0.0300837 -0.0967612 -0.1607919 -0.0406494 -0.0140859 -0.0778726 0.1084155 0.0521816 0.1436332 0.0555869 -0.0275061 0.0877187 -0.0800214 -0.0465453 unknown
polarizability: 263.2238297|-1.7348117|136.0872215|-15.3825372|-3.2203794|73.5571716 unknown
InChI: InChI=1S/C9H10N2O3S/c1-10(2)9(12)15-8-5-3-7(4-6-8)11(13)14/h3-6H,1-2H3
charge 0 multiplicity 1
25 atoms
S  1.819141 0.930605 -0.80204
O  2.176656 -1.481212 0.585318
O  -4.8336 0.835337 0.550331
O  -4.533076 -1.386676 0.125495
N  4.127325 -0.358163 -0.068682
N  -4.091237 -0.177807 0.243501
C  0.075364 0.511834 -0.428891
C  -2.648078 0.061894 0.013157
C  -0.772116 1.59478 -0.080755
C  -0.446583 -0.799697 -0.553868
C  -2.145212 1.375746 0.136252
C  -1.816594 -1.028468 -0.325323
C  2.766028 -0.521829 0.032854
C  4.758927 0.802327 -0.728747
C  5.009772 -1.396502 0.507929
H  -0.354902 2.600764 0.026444
H  0.210071 -1.631204 -0.814234
H  -2.821439 2.190853 0.405415
H  -2.248631 -2.02859 -0.411128
H  5.851208 0.712333 -0.621726
H  4.441238 1.752462 -0.262613
H  4.517193 0.838413 -1.806907
H  4.384877 -2.185763 0.950916
H  5.652612 -0.960442 1.294445
H  5.649357 -1.837999 -0.278443
