program: Gaussian 09
title: 000299071
version: EM64L-G09RevD.01
frameworkgroup: C1[X(C11H13NO3S)]
method: RPBEPBE
basis: SDD
operation: Freq
keyword: #p
keyword: freq=noraman
keyword: PBEPBE/SDD
title: #p freq=noraman PBEPBE/SDD
converged: YES YES NO NO
title: Mulliken charges:
elementType: S O O O N C C C C C C C C C C C H H H H H H H H H H H H H
charge: 0.021511 -0.299150 -0.286275 -0.216296 -0.030203 0.327076 0.232708 -0.294265 -0.336745 -0.201051 -0.217136 -0.218960 -0.656303 -0.606739 0.262973 -0.746783 0.270634 0.251227 0.231724 0.232658 0.231085 0.235493 0.313213 0.219223 0.264849 0.261971 0.254142 0.255023 0.244400
chargesum: 0.00000
title: Mulliken charges with hydrogens summed into heavy atoms:
elementType: S O O O N C C C C C C C C C C C
charge: 0.021511 -0.299150 -0.286275 -0.216296 -0.030203 0.327076 0.232708 -0.023631 -0.085518 -0.201051 0.014588 0.013697 0.123487 0.139304 0.262973 0.006782
polarizability: 1.82052403e+02 1.91570933e+01 1.73485179e+02 6.10690196e+00 2.65299610e+00 1.06534700e+02
1716.lowfreq: -10.6771 -1.2423 0.0006 0.0012 0.0021 7.5968 25.0574 33.8437 50.6503
frequency: 24.8227 33.7614 50.6461 62.2107 64.6427 85.9219 93.6370 104.1813 117.9300 147.7949 187.7653 208.8324 247.5150 279.7356 291.4724 295.1631 347.8563 422.7247 444.7519 447.5191 508.3931 516.3012 537.6945 558.7627 572.6229 610.5382 638.7654 651.4752 705.3858 751.3962 767.9198 814.0675 854.6291 874.8764 928.2206 937.7100 977.5441 989.5517 1030.5958 1039.3625 1051.7616 1066.8390 1087.1354 1091.4087 1138.7351 1153.8954 1158.6720 1168.9932 1181.9973 1225.5838 1252.7790 1266.7787 1382.1454 1383.8786 1399.3046 1428.8168 1437.7429 1451.4455 1452.5612 1453.6392 1463.4844 1475.9481 1478.7596 1493.6802 1521.3634 1597.7679 1604.3230 1680.4819 2976.7399 2990.0470 3008.3862 3053.8160 3075.2434 3097.7310 3109.4391 3141.5938 3143.7567 3146.4323 3156.8868 3172.0076 3182.5391
redmass: 5.5559 5.0497 3.6836 1.9090 1.3414 1.9605 2.5037 4.8273 3.1281 1.1589 5.3107 6.7685 2.6619 4.8188 4.6494 4.9632 4.1378 3.5183 3.4755 4.3930 4.9536 4.4905 4.3155 3.5399 8.9943 6.7810 6.0522 6.2518 4.6350 2.1557 1.9381 5.5475 1.5603 5.6567 3.8468 1.3986 1.3209 2.0252 2.1302 1.6532 1.5592 6.1168 2.8047 1.2589 1.3669 2.1315 1.8111 1.0987 2.9491 3.5541 2.7913 1.8657 1.3301 6.1872 1.8705 1.1296 2.3330 1.0422 1.0519 1.0567 1.1575 2.5272 1.0502 1.0474 1.9483 7.3973 7.1865 10.2058 1.0367 1.0339 1.0370 1.1017 1.1012 1.0966 1.1017 1.0859 1.1016 1.0974 1.0911 1.0960 1.0991
irintensity: 1.3224 4.1475 0.0687 3.7256 1.2792 0.6742 2.3534 6.0124 2.3197 0.2565 1.0717 0.4318 6.9189 0.6247 4.4949 2.3805 3.3588 2.6542 5.3833 9.7027 7.6618 0.0442 2.2615 4.9186 3.1525 2.1811 6.6553 5.1264 0.8923 21.9340 56.9682 41.9035 3.1198 38.4317 0.7030 2.0381 0.8404 73.1183 15.8896 13.7011 180.8094 149.9381 195.1643 12.7298 0.4905 162.0156 72.4684 17.2524 212.2833 208.0595 48.9412 21.3069 50.5301 17.8745 100.8665 8.7979 17.0086 23.1188 14.3593 24.3511 26.7491 133.6658 18.8418 15.6701 210.7878 3.5649 6.6752 165.6317 48.2943 55.6753 1.4965 29.2782 15.8370 7.0772 18.8344 1.6471 9.5810 0.3946 16.0894 13.3644 4.7681
temp: 298.150 k
press: 1.00000 atm
elementType: 16 8 8 8 7 6 6 6 6 6 6 6 6 6 6 6 1 1 1 1 1 1 1 1 1 1 1 1 1
symmnumber: 1
zpe: 580363.7 jmol-1
zpe.correction: 0.221049 hartree
zpe.thermalcorrener: 0.238260 hartree
zpe.thermalcorrenthalpy: 0.239205 hartree
zpe.thermalcorrgfe: 0.173619 hartree
zpe.sumelectzpe: -1104.256963 hartree
zpe.sumelectthermal: -1104.239751 hartree
zpe.sumelectthermalent: -1104.238807 hartree
zpe.sumelectthermalfe: -1104.304393 hartree
dipole: 1.0527 2.4891 0.7345
dipole: 2.8006
quadrupole: -82.0727 -92.9018 -106.9973
quadrupole: 9.6618 7.7837 -10.8555
quadrupole: 11.9179 1.0888 -13.0067 9.6618 7.7837 -10.8555
hfenergy: -1104.4780116 hartree
pointgroup: C01 [X(C11H13N1O3S1)]
dipole: -0.4971321 -0.9015495 0.3926166 debye
polarizability: 185.2031418|17.051314|168.8590533|-10.0124457|-8.6811719|108.0100867 unknown
InChI: InChI=1S/C11H13NO3S/c1-8(13)14-9-6-4-5-7-10(9)15-11(16)12(2)3/h4-7H,1-3H3
charge 0 multiplicity 1
29 atoms
S  -2.045691 1.985811 -1.353766
O  -0.748154 0.123535 0.240775
O  1.335256 -1.41208 -0.823364
O  0.697065 -2.200627 1.298417
N  -3.019431 0.063581 0.336492
C  0.514483 0.73831 0.087904
C  1.573504 -0.082341 -0.365997
C  0.765655 2.074504 0.459645
C  2.879932 0.431718 -0.467029
C  -1.951343 0.711388 -0.223744
C  2.075363 2.590687 0.356812
C  3.132028 1.773962 -0.10922
C  -2.898395 -1.023359 1.334758
C  -4.380657 0.464006 -0.070172
C  0.842697 -2.3952 0.079101
C  0.551999 -3.662488 -0.690835
H  -0.059089 2.699564 0.810837
H  3.677161 -0.224648 -0.828753
H  2.267075 3.630617 0.64015
H  4.146704 2.17642 -0.191179
H  -3.333632 -1.957726 0.9325
H  -3.445388 -0.746731 2.255171
H  -1.842591 -1.196445 1.579263
H  -5.105629 -0.19044 0.440075
H  -4.501228 0.374569 -1.163993
H  -4.574822 1.51743 0.199535
H  1.417052 -3.938851 -1.316384
H  -0.3022 -3.494538 -1.370608
H  0.313079 -4.476729 0.008111
