program: Gaussian 09
title: 000299061
version: EM64L-G09RevD.01
frameworkgroup: C1[X(C10H13NO2S)]
method: RPBEPBE
basis: SDD
operation: Freq
keyword: #p
keyword: freq=noraman
keyword: PBEPBE/SDD
title: #p freq=noraman PBEPBE/SDD
converged: YES YES NO NO
title: Mulliken charges:
elementType: S O O N C C C C C C C C C C H H H H H H H H H H H H H
charge: 0.098647 -0.267652 -0.221915 -0.102368 -0.171470 0.332448 -0.161095 -0.224820 -0.350874 -0.338685 0.016228 -0.605740 -0.616284 -0.538818 0.255336 0.249740 0.241202 0.251662 0.226669 0.260338 0.240495 0.277718 0.231743 0.227947 0.221042 0.244631 0.223875
chargesum: 0.00000
title: Mulliken charges with hydrogens summed into heavy atoms:
elementType: S O O N C C C C C C C C C C
charge: 0.098647 -0.267652 -0.221915 -0.102368 -0.171470 0.332448 0.094241 0.024919 -0.109671 -0.087023 0.016228 0.121762 0.121125 0.150729
polarizability: 2.30126006e+02 -6.39088823e+00 1.22904574e+02 4.59270499e+00 8.45173284e+00 8.85181676e+01
1716.lowfreq: -8.1467 -2.9860 0.0009 0.0016 0.0029 4.2008 28.5370 30.5983 47.9054
frequency: 28.5165 30.5727 47.8829 84.4477 100.3116 106.2779 122.1019 154.5660 188.1012 218.6986 231.2410 238.8697 283.0561 324.8396 352.4153 378.1520 403.4830 415.3249 459.6763 481.5321 517.8460 603.4035 608.6175 626.6908 651.3657 712.4217 771.1707 805.0927 828.5032 878.9523 934.3449 957.5030 987.0959 993.2191 1055.4107 1067.2029 1085.2177 1092.2467 1106.3737 1112.6817 1138.2543 1156.2441 1176.6957 1228.3184 1237.6982 1290.1269 1348.1126 1366.8648 1407.1185 1417.4095 1436.1705 1441.7785 1467.4185 1470.4044 1471.0433 1473.6416 1480.2288 1484.0330 1494.2082 1577.9086 1604.8387 1645.1530 2960.0440 2968.9441 2974.4995 3047.9175 3049.6349 3053.7894 3100.4230 3125.2584 3125.4054 3148.4078 3156.1338 3172.2666 3179.0055
redmass: 3.7030 4.4129 4.4128 1.3358 2.9576 3.1933 1.1482 4.2630 3.9497 3.7921 1.2654 2.8887 3.8378 4.6141 4.9510 8.4378 3.3136 2.9650 4.9858 4.4990 2.7725 7.4094 9.3126 7.1033 5.9201 3.5752 6.0776 1.3113 1.5481 4.9992 1.3573 1.3493 8.7359 3.6499 1.4454 2.1014 2.3394 1.2448 1.3415 1.2601 1.3824 1.3298 1.2248 3.3819 5.5327 1.2603 3.2238 5.1777 4.0942 1.1569 1.1826 1.1622 1.0498 1.0906 1.1728 1.0505 1.7385 1.0484 1.1282 7.3923 6.4130 8.9643 1.0329 1.0365 1.0366 1.1039 1.1019 1.0995 1.0990 1.0994 1.0977 1.0886 1.0877 1.0966 1.0968
irintensity: 2.8688 3.1721 3.8106 0.0632 1.8265 2.1981 0.7014 5.2628 1.3031 0.7927 0.3832 5.2276 2.3551 14.6874 22.5931 1.6301 3.4603 0.7692 1.7825 4.5202 23.7897 13.9790 13.8452 5.5609 30.7552 0.5901 1.9959 14.1769 69.0163 33.8670 0.8624 0.3522 37.0757 34.0650 54.5028 184.2004 120.7743 8.9744 12.1972 0.2680 1.5773 1.2293 70.5106 195.5020 43.8273 2.3461 130.5845 7.6127 1.5031 35.2738 18.9422 3.9518 13.4442 61.6224 95.5636 4.2762 41.4057 27.0690 15.8376 15.7146 80.8347 230.8981 69.3651 32.5586 117.5593 47.3879 49.2550 17.3911 14.2786 27.3348 2.3121 4.2126 9.7975 10.4426 3.1050
temp: 298.150 k
press: 1.00000 atm
elementType: 16 8 8 7 6 6 6 6 6 6 6 6 6 6 1 1 1 1 1 1 1 1 1 1 1 1 1
symmnumber: 1
zpe: 555790.0 jmol-1
zpe.correction: 0.211689 hartree
zpe.thermalcorrener: 0.227135 hartree
zpe.thermalcorrenthalpy: 0.228079 hartree
zpe.thermalcorrgfe: 0.167201 hartree
zpe.sumelectzpe: -991.056127 hartree
zpe.sumelectthermal: -991.040681 hartree
zpe.sumelectthermalent: -991.039737 hartree
zpe.sumelectthermalfe: -991.100615 hartree
dipole: 2.0052 0.6118 0.6518
dipole: 2.1955
quadrupole: -58.5598 -88.2805 -91.8344
quadrupole: -8.0878 -4.3961 5.2087
quadrupole: 20.9984 -8.7222 -12.2762 -8.0878 -4.3961 5.2087
hfenergy: -991.2678162 hartree
pointgroup: C01 [X(C10H13N1O2S1)]
dipole: 0.7868646 -0.2835294 -0.2157728 debye
polarizability: 229.4756605|6.5757089|125.0293238|-10.252919|-0.6940083|87.0437626 unknown
InChI: InChI=1S/C10H13NO2S/c1-11(2)10(12)14-9-6-4-8(13-3)5-7-9/h4-7H,1-3H3
charge 0 multiplicity 1
27 atoms
S  1.523108 0.852978 -1.102302
O  -4.280135 -0.062254 0.36737
O  1.814381 -1.444365 0.451266
N  3.804317 -0.331387 -0.075171
C  -0.214567 0.49232 -0.630156
C  -2.928567 0.050115 0.008366
C  -0.817427 -0.745428 -0.935626
C  -0.969526 1.511859 0.000773
C  -2.173361 -0.976316 -0.613076
C  -2.324561 1.296686 0.311787
C  2.433212 -0.497658 -0.093883
C  4.525777 0.784742 -0.706244
C  4.633251 -1.376956 0.558463
C  -4.949014 -1.33654 0.09428
H  -0.229541 -1.535152 -1.410811
H  -0.496241 2.467169 0.24892
H  -2.619374 -1.946829 -0.84873
H  -2.926793 2.070783 0.796372
H  5.384074 1.065358 -0.069279
H  3.872164 1.665805 -0.805186
H  4.907218 0.510227 -1.709101
H  3.972818 -2.169073 0.940646
H  5.213116 -0.95082 1.39884
H  5.33711 -1.810184 -0.177665
H  -4.965642 -1.558386 -0.990691
H  -5.977459 -1.205363 0.461377
H  -4.462441 -2.170832 0.636061
