program: Gaussian 09
title: 000299062
version: EM64L-G09RevD.01
frameworkgroup: C1[X(C12H16N2O2S2)]
method: RPBEPBE
basis: SDD
operation: Freq
keyword: #p
keyword: freq=noraman
keyword: PBEPBE/SDD
title: #p freq=noraman PBEPBE/SDD
converged: NO YES NO NO
title: Mulliken charges:
elementType: S S O O N N C C C C C C C C C C C C H H H H H H H H H H H H H H H H
charge: 0.008125 0.008134 -0.319016 -0.319008 -0.050422 -0.050424 0.422031 0.421976 -0.316380 -0.316566 -0.316590 -0.316362 -0.196535 -0.196530 -0.618615 -0.584452 -0.618619 -0.584452 0.251585 0.251569 0.251572 0.251585 0.228158 0.287283 0.228312 0.271180 0.226922 0.226840 0.228292 0.228177 0.287287 0.226901 0.226863 0.271180
chargesum: 0.00000
title: Mulliken charges with hydrogens summed into heavy atoms:
elementType: S S O O N N C C C C C C C C C C C C
charge: 0.008125 0.008134 -0.319016 -0.319008 -0.050422 -0.050424 0.422031 0.421976 -0.064795 -0.064998 -0.065018 -0.064776 -0.196535 -0.196530 0.125137 0.140491 0.125136 0.140491
polarizability: 2.83433904e+02 1.96971751e-03 1.59790419e+02 3.20507274e-02 -3.46507310e-03 1.30017769e+02
1716.lowfreq: -33.5566 -20.6683 -10.7949 -6.1672 -0.0022 -0.0022 -0.0011 9.6240 28.7431
frequency: -33.4817 -20.6334 28.4213 34.2598 40.9403 63.1125 63.9779 79.4028 79.4656 82.5274 98.9543 101.1044 166.0487 181.9914 247.2784 250.6741 260.5236 310.1975 314.6273 329.8112 368.6886 413.7421 414.7476 418.9405 439.8663 453.1018 502.5145 509.8834 579.0836 579.7449 607.5253 612.4374 627.8780 642.0302 713.8205 782.2177 812.8379 833.0661 835.3156 937.7230 940.7219 945.2141 956.6224 1002.3826 1052.1931 1052.5790 1062.5370 1065.3917 1091.3971 1091.4927 1094.9678 1145.8003 1145.8124 1149.3944 1153.4850 1154.0141 1157.3857 1199.6340 1251.1268 1254.6471 1279.5901 1379.0767 1401.0100 1401.9266 1402.0230 1418.9925 1419.0955 1449.4150 1451.0832 1466.2953 1466.4541 1475.7434 1475.7750 1480.8654 1487.1502 1487.2624 1527.8232 1527.9246 1606.2724 1606.9569 2967.3351 2967.3777 2974.2674 2974.6485 3043.2130 3043.2432 3048.6079 3048.6277 3111.0448 3111.0508 3157.9626 3157.9974 3161.4390 3161.7208 3179.1759 3183.2301
redmass: 4.1488 6.3512 3.9477 6.4611 4.3658 1.0749 1.1147 1.1952 1.1917 8.1050 2.6924 2.6974 7.0483 5.3990 2.7370 2.6830 5.0304 7.3265 4.6729 9.8715 3.1854 2.9317 2.9282 4.8902 3.9368 4.0050 4.3517 4.2556 11.0414 11.1604 4.4507 8.9844 7.2815 6.5524 4.3234 6.0564 1.2455 6.2461 1.6896 2.7158 3.9229 1.6014 1.3636 2.7205 1.3973 1.3840 9.9279 9.1939 1.2196 1.2177 1.2617 1.3746 1.3745 2.5734 1.8046 2.1014 1.2501 6.4337 5.6580 6.3215 1.2566 7.8735 1.7324 3.7319 1.7006 1.1369 1.1381 1.2310 1.2185 1.0578 1.0579 1.0431 1.0431 2.4637 1.0443 1.0444 1.7244 1.7296 6.6232 8.2564 1.0358 1.0358 1.0378 1.0377 1.1015 1.1014 1.1018 1.1018 1.0984 1.0984 1.0952 1.0952 1.0891 1.0887 1.0978 1.0984
irintensity: 0.0551 0.0000 5.3361 1.9020 0.0000 0.1839 0.0004 0.0102 0.0758 2.2540 0.2305 0.0000 0.0596 3.9062 14.8689 0.0000 3.4842 8.6988 1.6747 3.6785 4.4711 0.0000 4.2579 0.0001 1.3195 31.9675 0.0993 1.6900 0.0000 2.1575 3.6906 10.8155 0.0000 0.2416 4.0964 23.1491 0.5040 0.4388 43.7374 20.1463 0.7246 0.3263 0.0000 85.1427 42.1484 21.4977 403.8521 250.9411 0.2989 0.0013 14.6313 0.0086 0.0507 761.2948 56.7937 0.4899 0.0000 118.2948 7.5127 98.6212 0.0000 2.2621 153.7892 2.6169 63.1803 11.8623 20.7423 201.4028 2.8156 5.6988 52.0659 0.0010 1.2758 198.2913 0.0252 68.4883 45.1252 274.7679 7.1829 0.0001 44.7783 27.9859 253.8779 36.8605 0.0230 73.7682 4.4041 51.7513 1.3434 3.4949 2.3115 2.2840 0.0030 14.2048 4.7460 0.2459
temp: 298.150 k
press: 1.00000 atm
elementType: 16 16 8 8 7 7 6 6 6 6 6 6 6 6 6 6 6 6 1 1 1 1 1 1 1 1 1 1 1 1 1 1 1 1
symmnumber: 1
zpe: 689569.1 jmol-1
zpe.correction: 0.262643 hartree
zpe.thermalcorrener: 0.281564 hartree
zpe.thermalcorrenthalpy: 0.282508 hartree
zpe.thermalcorrgfe: 0.212603 hartree
zpe.sumelectzpe: -1521.577453 hartree
zpe.sumelectthermal: -1521.558532 hartree
zpe.sumelectthermalent: -1521.557588 hartree
zpe.sumelectthermalfe: -1521.627493 hartree
dipole: -0.0004 -5.2509 -0.0023
dipole: 5.2509
quadrupole: -64.4517 -130.2715 -115.1021
quadrupole: -0.0022 0.0210 -0.0023
quadrupole: 38.8234 -26.9964 -11.8270 -0.0022 0.0210 -0.0023
hfenergy: -1521.8400959 hartree
pointgroup: C01 [X(C12H16N2O2S2)]
dipole: -0.0017069 2.0658752 -0.0008957 debye
polarizability: 283.4338019|0.1123726|159.7905214|-0.0320538|0.0034365|130.0177694 unknown
InChI: InChI=1S/C12H16N2O2S2/c1-13(2)11(17)15-9-5-7-10(8-6-9)16-12(18)14(3)4/h5-8H,1-4H3
charge 0 multiplicity 1
34 atoms
S  -2.974521 -2.060181 -0.001395
S  2.978598 -2.054765 0.002024
O  -2.814731 0.688144 0.001348
O  2.814239 0.693288 -0.000634
N  -4.944805 -0.123412 0.000126
N  4.945647 -0.114686 -0.000229
C  -1.389529 0.572196 0.00081
C  1.389242 0.574809 -0.000097
C  -0.705974 0.573068 -1.230464
C  0.704883 0.574373 -1.230921
C  -0.705171 0.573168 1.231635
C  0.705685 0.574521 1.231176
C  -3.617454 -0.479185 0.000335
C  3.618904 -0.4727 0.000555
C  -5.417876 1.275674 0.001546
C  -6.004275 -1.144986 -0.000838
C  5.416321 1.285206 -0.002051
C  6.006864 -1.13445 -0.000078
H  -1.271271 0.5663 -2.166589
H  1.269602 0.568637 -2.167401
H  -1.269874 0.566485 2.168117
H  1.270997 0.568887 2.167299
H  -6.040335 1.462617 -0.894541
H  -4.564059 1.963208 -0.000785
H  -6.035421 1.462827 0.901021
H  -5.542402 -2.143557 -0.000564
H  -6.638551 -1.033418 -0.900947
H  -6.639966 -1.033504 0.89828
H  6.033479 1.473146 -0.901624
H  6.038526 1.473482 0.893937
H  4.561329 1.971285 0.00016
H  6.64198 -1.021353 0.899243
H  6.641324 -1.022313 -0.899986
H  5.546696 -2.133809 0.000634
