program: Gaussian 09
title: 000299067
version: EM64L-G09RevD.01
frameworkgroup: C1[X(C11H13NO3S)]
method: RPBEPBE
basis: SDD
operation: Freq
keyword: #p
keyword: freq=noraman
keyword: PBEPBE/SDD
title: #p freq=noraman PBEPBE/SDD
converged: YES YES NO NO
title: Mulliken charges:
elementType: S O O O N C C C C C C C C C C C H H H H H H H H H H H H H
charge: -0.003622 -0.283194 -0.285916 -0.255681 -0.023784 0.304621 0.170572 -0.350499 -0.317375 -0.200338 -0.233264 -0.199021 0.194919 -0.608580 -0.613974 -0.499919 0.257859 0.273924 0.234996 0.234118 0.216998 0.289105 0.241707 0.269227 0.240029 0.227889 0.246969 0.233334 0.238900
chargesum: 0.00000
title: Mulliken charges with hydrogens summed into heavy atoms:
elementType: S O O O N C C C C C C C C C C C
charge: -0.003622 -0.283194 -0.285916 -0.255681 -0.023784 0.304621 0.170572 -0.092641 -0.043451 0.034658 0.000853 -0.199021 0.194919 0.139231 0.123171 0.219284
polarizability: 1.90223119e+02 1.65569140e+01 1.58985968e+02 -1.53991716e+01 3.28442068e+00 1.14546419e+02
1716.lowfreq: -0.0014 -0.0012 0.0011 4.8089 6.8882 12.6285 25.2761 45.6970 56.0768
frequency: 24.9400 45.6828 56.0452 69.5448 79.3988 94.8588 100.4696 109.8210 118.1460 158.9796 174.6609 215.0542 248.3219 260.1300 298.8164 313.0381 338.1138 393.8362 428.4860 437.7859 450.4435 507.3196 529.1920 564.4530 615.7804 643.8165 652.6229 675.2573 756.5414 762.3336 779.8074 820.8542 883.6342 921.1477 937.1900 967.5889 995.8820 1031.7230 1044.2849 1055.3096 1061.3899 1093.1447 1113.8089 1121.2187 1139.7268 1147.4086 1155.1351 1171.9720 1190.6508 1241.7441 1264.4232 1269.4345 1384.6518 1403.3946 1421.6443 1425.8307 1432.7156 1451.1451 1456.0290 1462.1213 1463.9360 1472.2137 1479.4386 1485.9390 1531.0137 1578.1109 1607.3398 1624.1030 2974.5134 2995.5087 3003.6077 3058.7493 3089.3501 3105.3766 3110.8241 3120.4707 3139.3601 3147.9361 3157.6826 3175.6399 3184.2196
redmass: 5.2858 1.9213 4.7349 2.1318 4.0540 1.7860 1.2036 1.8355 2.0820 4.1198 4.4190 4.0548 4.0172 4.7203 6.4397 4.3415 4.7770 5.0687 4.0364 3.8548 5.0302 5.0536 4.5051 8.5514 6.5867 6.7574 6.3665 4.6683 3.8305 5.6116 1.4890 6.2556 1.4230 6.9173 4.2328 1.3870 1.3420 3.9217 2.9720 4.6439 1.6384 1.2267 1.2714 1.8580 1.4008 1.4809 1.8589 1.0730 3.1690 3.6007 4.5356 1.4965 10.6518 1.6277 1.2292 1.1454 2.0822 1.0501 1.1300 1.0462 1.0527 2.5134 1.0765 1.0637 2.1366 6.8731 7.6974 8.7753 1.0347 1.0349 1.0296 1.1016 1.0994 1.1044 1.0993 1.1026 1.0865 1.1046 1.0921 1.0954 1.0978
irintensity: 0.4185 2.8272 4.9382 2.6457 0.6937 2.2100 0.1689 0.2154 0.0723 2.7992 4.4721 0.6860 2.9750 3.9591 15.0177 6.2016 12.2211 1.9874 8.8541 0.4484 5.8893 1.6031 1.6851 4.3317 3.6166 0.6051 11.6830 22.8252 17.2878 4.1156 50.3274 28.6122 0.1981 9.0553 0.7979 1.4786 0.5983 122.5297 205.6962 119.4912 85.6538 4.1493 0.8691 52.7466 10.4488 53.8266 144.5204 5.4021 134.8806 213.6227 42.0819 31.5243 3.2831 72.4458 25.9398 15.9089 22.5237 14.7153 26.7659 18.6678 13.7239 65.7526 2.6563 19.2176 220.1106 17.0818 57.5067 227.9298 61.9686 62.4163 37.5706 30.9340 17.6291 24.2354 2.7408 9.3665 3.4332 16.3663 18.3780 5.8527 9.1676
temp: 298.150 k
press: 1.00000 atm
elementType: 16 8 8 8 7 6 6 6 6 6 6 6 6 6 6 6 1 1 1 1 1 1 1 1 1 1 1 1 1
symmnumber: 1
zpe: 583025.4 jmol-1
zpe.correction: 0.222063 hartree
zpe.thermalcorrener: 0.239120 hartree
zpe.thermalcorrenthalpy: 0.240064 hartree
zpe.thermalcorrgfe: 0.175451 hartree
zpe.sumelectzpe: -1104.257321 hartree
zpe.sumelectthermal: -1104.240264 hartree
zpe.sumelectthermalent: -1104.239320 hartree
zpe.sumelectthermalfe: -1104.303933 hartree
dipole: -0.0901 1.1317 -2.5247
dipole: 2.7682
quadrupole: -80.0060 -86.2332 -107.7768
quadrupole: 2.0071 -5.3173 4.2003
quadrupole: 11.3327 5.1055 -16.4381 2.0071 -5.3173 4.2003
hfenergy: -1104.4793841 hartree
pointgroup: C01 [X(C11H13N1O3S1)]
dipole: 0.0314977 -0.427632 -1.0011492 debye
polarizability: 188.1994384|18.8659655|162.322654|12.57363|-2.1025692|113.2334139 unknown
InChI: InChI=1S/C11H13NO3S/c1-12(2)11(16)15-9-7-5-4-6-8(9)10(13)14-3/h4-7H,1-3H3
charge 0 multiplicity 1
29 atoms
S  -1.463822 0.549412 2.16369
O  -1.021173 1.011882 -0.518343
O  1.71812 -2.230614 0.304073
O  -0.349725 -1.730784 -0.628561
N  -3.017357 0.040701 -0.067337
C  0.362092 1.179573 -0.271205
C  1.241536 0.07214 -0.105022
C  0.846302 2.50089 -0.275197
C  2.623853 0.341755 0.085364
C  2.225236 2.744654 -0.103178
C  3.115462 1.661631 0.085638
C  -1.867781 0.498917 0.505197
C  0.754864 -1.335534 -0.177536
C  -3.135322 -0.109685 -1.536741
C  -4.143594 -0.422708 0.758465
C  1.328401 -3.658085 0.26987
H  0.130222 3.318346 -0.397138
H  3.29991 -0.505257 0.226571
H  2.598497 3.774311 -0.104332
H  4.184834 1.845611 0.230622
H  -4.021006 -0.729092 -1.751735
H  -2.233597 -0.607049 -1.926789
H  -3.248768 0.870944 -2.032836
H  -3.955775 -0.147856 1.807554
H  -4.244462 -1.522627 0.691098
H  -5.08146 0.047324 0.410353
H  0.423174 -3.818557 0.87899
H  2.190547 -4.192904 0.692249
H  1.128794 -3.97844 -0.766785
