program: Gaussian 09
title: 000299187
version: EM64L-G09RevD.01
frameworkgroup: C1[X(C20H23BrO3S)]
method: RPBEPBE
basis: SDD
operation: Freq
keyword: #p
keyword: freq=noraman
keyword: PBEPBE/SDD
title: #p freq=noraman PBEPBE/SDD
converged: YES YES NO NO
title: Mulliken charges:
elementType: Br S O O O C C C C C C C C C C C C C C C C C C C C H H H H H H H H H H H H H H H H H H H H H H H
charge: 0.038993 0.933217 -0.331648 -0.516069 -0.520237 0.237025 0.216099 0.203291 0.190898 0.231483 -0.151118 -0.690976 -0.874046 -0.870173 -0.842942 -0.861554 0.467714 -0.808668 -0.093251 -0.703131 -0.211268 -0.216291 -0.171702 -0.160082 -0.204871 0.241967 0.238486 0.237000 0.258784 0.254022 0.254358 0.237870 0.255305 0.278625 0.243144 0.224919 0.243624 0.271169 0.228416 0.233641 0.223838 0.224316 0.239314 0.219486 0.286184 0.289029 0.262514 0.263294
chargesum: 0.00000
title: Mulliken charges with hydrogens summed into heavy atoms:
elementType: Br S O O O C C C C C C C C C C C C C C C C C C C C
charge: 0.038993 0.933217 -0.331648 -0.516069 -0.520237 0.237025 0.216099 0.203291 0.190898 0.231483 -0.151118 -0.210523 -0.124239 -0.122640 -0.096254 -0.118346 0.467714 -0.126873 -0.093251 -0.244331 0.074916 0.072738 0.090812 0.103212 -0.204871
polarizability: 5.50368079e+02 -1.76279554e+01 2.67225475e+02 -2.77131576e+01 -6.55958852e-01 1.86856599e+02
1716.lowfreq: -9.9363 -2.9439 -2.3904 -0.0008 0.0011 0.0017 7.7583 13.1411 28.2008
frequency: 6.4467 13.0521 28.1684 34.6619 44.1488 47.3532 64.1363 65.8058 83.5678 94.0878 106.2000 111.1213 114.2040 126.3611 135.4147 145.7057 164.1605 167.7161 177.2772 181.5715 202.5787 227.4095 251.6270 268.6081 283.4193 320.3548 330.4063 335.3337 345.4861 349.8006 360.0424 372.8276 387.3634 394.6750 406.9696 424.0515 427.2701 438.4364 441.9626 473.0893 491.3111 506.3267 567.3673 580.1084 602.1099 610.3655 615.8375 683.4992 687.7169 694.1015 703.1181 773.1981 796.8491 827.4780 831.6172 832.0121 832.3881 841.9346 910.5981 937.2162 955.8639 957.9866 962.2129 975.8967 976.4185 983.3361 1000.4252 1017.1607 1022.8868 1027.2753 1029.2834 1043.9342 1050.4751 1053.7683 1054.9283 1061.7921 1080.7133 1095.3579 1104.6860 1121.7386 1177.5289 1197.9770 1230.1891 1259.5443 1281.9626 1290.8558 1312.1652 1357.8820 1372.8456 1373.2810 1376.3012 1387.0671 1391.5050 1392.4546 1397.3476 1400.5734 1425.9111 1431.3618 1444.5328 1445.6570 1447.4538 1460.8470 1467.0181 1469.4716 1472.6727 1475.2257 1481.5146 1489.2157 1500.0290 1507.6366 1535.3772 1560.9701 1578.5786 1587.4107 1672.8084 2960.9484 2972.9242 2973.0061 2973.6821 2977.8880 2980.8279 3011.1493 3033.3291 3053.0699 3055.7699 3056.2416 3060.5379 3088.3819 3097.1149 3104.2192 3107.3630 3108.8942 3117.4834 3156.0832 3159.4894 3176.7432 3180.0308 3199.4507
redmass: 5.9866 7.0753 5.1049 3.8585 2.9238 4.7317 3.4652 3.2236 7.3118 2.4142 3.6092 4.0979 1.4086 1.3671 7.0282 1.5820 1.4446 1.0535 3.3221 1.7056 4.0675 7.5224 7.9460 3.5903 4.4176 5.5717 4.0766 2.6292 3.4646 5.5996 2.4798 3.0553 8.1246 4.6777 2.8913 3.1089 2.1520 3.9119 6.2007 5.5172 3.8522 3.6588 5.4367 3.2969 2.6584 7.0929 4.5657 6.7478 1.0487 5.4970 4.1862 3.9940 14.3479 2.7072 2.2769 1.3610 1.5725 2.8403 18.3919 1.4575 1.7561 1.4825 1.3260 1.5568 4.5649 1.4432 1.3687 1.4737 1.4678 1.5299 1.9311 5.9385 1.5951 1.8826 1.7167 2.0399 2.0131 2.2625 1.3432 4.3389 1.1244 1.2246 1.9016 6.0417 1.2287 4.6691 2.2728 5.4721 3.6422 3.8826 8.7650 1.2231 1.2486 1.2272 1.2231 1.2156 1.1863 3.2486 1.7189 1.2588 1.1981 1.0486 1.0926 1.0978 1.1638 1.0945 1.0920 1.0616 1.0715 1.0643 4.5913 6.1392 6.0509 8.1638 4.8791 1.0389 1.0493 1.0508 1.0454 1.0401 1.0399 1.0984 1.0967 1.0958 1.0934 1.0948 1.0916 1.0979 1.0629 1.0970 1.0962 1.0965 1.0958 1.0893 1.0893 1.0964 1.0975 1.1143
irintensity: 0.3518 0.3888 0.0924 0.2183 0.0299 0.2011 3.7093 1.6974 1.9903 9.0145 6.5076 2.2695 0.2725 0.4672 17.9678 7.0655 3.3155 0.2998 8.2995 0.2792 15.7401 0.6906 2.3098 36.4481 31.9264 38.5669 21.1487 1.0844 0.0856 1.3090 0.6168 0.7821 11.3335 10.0842 0.0356 4.2804 3.2663 5.8992 45.7124 28.4069 30.4090 76.3751 0.6297 0.1317 0.1782 0.6833 1.9590 46.2042 0.3358 1.9415 7.3339 13.6171 82.4607 0.7114 13.6253 0.9706 42.3562 2.9156 50.9859 28.5455 6.4492 23.8243 0.7212 23.1300 87.2057 11.1728 8.2884 0.9594 4.4396 4.3489 24.7591 79.8221 5.1851 14.4660 2.6129 8.8379 6.4110 2.7680 5.2955 1.1223 29.3088 0.6126 27.4887 124.2954 1.1506 129.7715 68.3231 5.4979 10.7672 2.9667 7.5660 6.1555 31.0914 1.0516 54.9759 0.9646 4.1554 13.2390 70.4905 3.8406 8.0849 18.4882 5.9372 44.5435 18.1340 27.8214 11.7469 2.9170 15.4848 1.6453 0.3615 33.1911 115.4161 0.5730 11.4992 27.7207 25.5081 34.5030 67.7696 11.8147 14.1356 9.7400 26.3717 18.1181 4.8341 20.1708 7.2563 26.1642 5.7498 11.1256 10.3947 3.2357 1.7807 2.3965 2.3655 1.1616 8.3591 28.3482
temp: 298.150 k
press: 1.00000 atm
elementType: 35 16 8 8 8 6 6 6 6 6 6 6 6 6 6 6 6 6 6 6 6 6 6 6 6 1 1 1 1 1 1 1 1 1 1 1 1 1 1 1 1 1 1 1 1 1 1 1
symmnumber: 1
zpe: 981607.5 jmol-1
zpe.correction: 0.373875 hartree
zpe.thermalcorrener: 0.402286 hartree
zpe.thermalcorrenthalpy: 0.403231 hartree
zpe.thermalcorrgfe: 0.310260 hartree
zpe.sumelectzpe: -1411.101653 hartree
zpe.sumelectthermal: -1411.073241 hartree
zpe.sumelectthermalent: -1411.072297 hartree
zpe.sumelectthermalfe: -1411.165267 hartree
dipole: 2.9700 -2.8750 -2.7083
dipole: 4.9418
quadrupole: -134.3123 -160.7795 -174.7827
quadrupole: -3.3097 -4.2568 -7.5111
quadrupole: 22.3125 -4.1546 -18.1579 -3.3097 -4.2568 -7.5111
hfenergy: -1411.4755275 hartree
pointgroup: C01 [X(C20H23Br1O3S1)]
dipole: -1.3168009 -0.7713973 1.2046421 debye
polarizability: 551.0561125|-21.7921427|266.0060905|-18.284845|-10.8042764|187.38795 unknown
InChI: InChI=1S/C14H19O.C6H4BrO2S/c1-8(2)7-13-9(3)11(5)14(15)12(6)10(13)4;7-5-1-3-6(4-2-5)10(8)9/h1,7H2,2-6H3;1-4H
charge 0 multiplicity 1
48 atoms
Br 7.592085 -1.78126 0.852115
S  1.852325 0.834767 -1.102354
O  0.79819 0.78635 0.785595
O  2.165683 2.361787 -1.602099
O  1.122272 -0.240242 -2.10088
C  -3.319046 0.077911 0.657407
C  -2.833993 1.425667 0.573592
C  -2.417783 -1.03441 0.707943
C  -1.44205 1.675047 0.573529
C  -1.02082 -0.807132 0.720258
C  -0.536164 0.553457 0.677924
C  -4.818268 -0.171242 0.695596
C  -3.821609 2.578572 0.470866
C  -2.964466 -2.454587 0.737131
C  -0.865656 3.072531 0.47352
C  -0.019452 -1.940516 0.801308
C  -5.514287 -0.354086 -0.661883
C  -7.01646 -0.559814 -0.570939
C  3.489033 0.088775 -0.546928
C  -4.852611 -0.339739 -1.848642
C  3.642674 -1.305748 -0.613895
C  4.49335 0.957195 -0.088619
C  4.873048 -1.863352 -0.200127
C  5.722118 0.396402 0.328108
C  5.890617 -1.004506 0.270715
H  -5.035552 -1.070556 1.305762
H  -5.32433 0.663459 1.219928
H  -4.30567 2.788025 1.445493
H  -3.328458 3.506849 0.145673
H  -4.62215 2.353787 -0.255784
H  -2.203499 -3.186873 0.42666
H  -3.302517 -2.742021 1.752827
H  -3.82506 -2.564403 0.05507
H  0.224523 3.051632 0.616862
H  -1.059929 3.515608 -0.52213
H  -1.309276 3.749776 1.226121
H  0.039282 -2.483897 -0.161873
H  0.981793 -1.54507 1.029671
H  -0.293628 -2.67232 1.581888
H  -7.46949 -0.698026 -1.567081
H  -7.260672 -1.448235 0.044792
H  -7.508871 0.306507 -0.086078
H  -3.768866 -0.191454 -1.90794
H  -5.38638 -0.477159 -2.796187
H  2.836472 -1.935807 -1.002994
H  4.33169 2.039415 -0.0758
H  5.032432 -2.94387 -0.246556
H  6.528624 1.041004 0.687634
