program: Gaussian 09
title: 000299079
version: EM64L-G09RevD.01
frameworkgroup: C1[X(C16H20N4O5)]
method: RPBEPBE
basis: SDD
operation: Freq
keyword: #p
keyword: freq=noraman
keyword: PBEPBE/SDD
title: #p freq=noraman PBEPBE/SDD
converged: YES YES NO NO
title: Mulliken charges:
elementType: O O O O O N N N N C C C C C C C C C C C C C C C C H H H H H H H H H H H H H H H H H H H H
charge: -0.452129 -0.185354 -0.304383 -0.211574 -0.206414 -0.034076 -0.418464 0.027444 0.014961 -0.433516 -0.526930 0.233925 -0.506900 0.274499 -0.040283 -0.599096 -0.401692 -0.837802 -0.316855 0.278628 0.281264 -0.281592 -0.502311 -0.376661 0.451257 0.225161 0.225792 0.227371 0.239412 0.243011 0.220961 0.232514 0.234519 0.225375 0.220802 0.236948 0.247679 0.242598 0.214537 0.178395 0.371919 0.356521 0.303431 0.334755 0.292354
chargesum: 0.00000
title: Mulliken charges with hydrogens summed into heavy atoms:
elementType: O O O O O N N N N C C C C C C C C C C C C C C C C
charge: -0.095608 -0.185354 -0.304383 -0.211574 -0.206414 -0.034076 -0.046545 0.027444 0.014961 0.017438 -0.060147 0.233925 -0.042928 0.274499 -0.040283 -0.132064 0.044484 -0.110578 0.076077 0.278628 0.281264 0.021840 -0.167556 -0.084307 0.451257
polarizability: 5.03396069e+02 -1.92673904e+01 2.67551128e+02 4.22089720e-01 -9.47728276e+00 1.22056093e+02
1716.lowfreq: -23.0128 -5.5399 -0.0007 -0.0007 -0.0001 2.0830 4.6831 17.4134 30.6665
frequency: -22.6990 17.3506 30.6433 52.8703 58.8014 68.2926 74.2131 89.9812 94.4252 118.5810 135.9187 148.0731 154.3591 164.0905 176.9753 189.3856 215.5950 239.6830 260.9197 297.8598 303.6207 322.9946 346.2076 361.0654 376.8646 382.0978 401.2920 430.2275 439.7262 456.4132 465.0518 503.5799 511.1686 515.9126 552.5936 558.7955 576.7030 622.8267 649.0395 656.9915 676.4327 691.3361 704.3326 709.7942 722.7202 742.2570 754.2074 787.4338 810.5423 828.4271 844.4104 862.8520 882.1364 890.8460 904.7066 933.5219 963.8907 979.0447 985.7612 996.8997 1013.5374 1019.3316 1026.2901 1044.1426 1053.2205 1072.2411 1074.9191 1087.0479 1102.3868 1124.7451 1136.3747 1141.0070 1148.8459 1176.0537 1192.9484 1198.6135 1211.5443 1230.3244 1247.8310 1257.6850 1259.0922 1278.8880 1292.4038 1314.2859 1318.3936 1330.5671 1334.6528 1347.4063 1354.1709 1360.0378 1369.2056 1376.1187 1382.9384 1392.4630 1440.2890 1448.8505 1455.5222 1458.2364 1461.4345 1463.9854 1472.2410 1474.4837 1488.6404 1493.9474 1506.7125 1532.7454 1573.5943 1595.8292 1621.4832 2940.8720 2942.7405 2970.6637 2977.8440 2988.0893 2991.3586 3003.5252 3006.0127 3026.7071 3044.0743 3056.8630 3060.0292 3068.0134 3085.6065 3093.2103 3181.1146 3186.9751 3204.2906 3318.8347 3505.9287
redmass: 1.1983 5.0643 3.8736 5.4419 9.5342 6.3419 6.8889 5.7366 4.8146 2.7211 4.7407 2.9571 5.9984 5.2525 4.7208 4.6007 3.3658 2.6429 4.7411 3.3146 4.9852 8.2835 2.3387 7.1688 4.7769 3.9842 3.7885 3.2617 3.8076 5.2024 4.2088 7.4975 3.9231 3.7872 1.0882 3.3846 4.6612 6.3893 7.8916 4.4391 7.5468 3.2353 7.5685 5.9881 4.1358 1.3045 7.2167 1.3381 2.2227 1.9718 1.5637 1.4417 1.8322 4.3478 2.7512 2.3878 1.4088 1.8232 3.4530 2.0716 1.3122 2.8198 2.3380 3.6685 2.1540 1.6939 1.9192 1.8773 3.4003 3.0686 1.4064 1.5316 1.2634 7.5309 1.6219 2.3164 4.0938 2.0223 1.2314 1.2715 1.3115 1.1222 1.8023 1.7938 1.8197 2.7203 1.4803 2.0198 2.0151 5.0473 1.5949 2.0742 1.5113 1.1879 1.1170 5.1653 1.7647 1.1903 1.1749 1.0784 1.0978 1.1036 1.1711 2.7728 1.1817 7.4280 6.7723 6.0863 7.3033 1.0655 1.0678 1.0430 1.0673 1.0604 1.0771 1.0604 1.0758 1.0976 1.0973 1.0894 1.1025 1.1009 1.0957 1.0994 1.0900 1.0919 1.0954 1.0778 1.0657
irintensity: 0.3745 0.1713 0.0385 0.9306 0.7936 0.9788 0.7274 2.7057 0.3818 2.2311 0.4542 0.6694 1.4222 3.2245 3.4429 1.8071 1.7959 1.6331 3.2624 4.7476 0.4410 1.5291 0.6477 1.4952 1.8425 1.5679 5.2254 2.3363 0.4503 3.0930 2.1488 8.5940 10.7356 4.0311 118.6748 8.5073 4.3743 5.2312 19.1798 6.6119 5.0733 4.4665 8.1894 2.7100 2.2593 10.3933 18.6681 62.2597 7.2881 3.7725 6.9725 24.7227 9.9143 0.3904 4.1022 18.2639 23.3710 37.3899 39.6997 2.7788 0.0784 18.7038 24.8154 26.2980 25.6807 41.4800 20.8557 49.7170 44.1407 9.7325 31.7438 8.0662 7.4237 442.0448 1.7644 74.8398 413.5049 226.2617 1.9248 5.9108 19.2833 6.5579 48.2337 1.8918 96.6091 167.4234 4.9758 33.8290 33.9302 65.7805 38.7823 32.0385 41.7192 20.7937 38.7263 0.3919 22.2410 6.2337 1.9674 3.6594 13.0819 9.1490 32.0110 91.5704 19.6932 157.8972 124.0167 166.0278 391.6598 29.1719 59.1200 26.9264 18.8082 11.0294 11.1572 35.9511 59.5042 2.6330 5.8611 22.0522 46.7553 102.8879 15.3956 17.7915 4.4321 21.1509 0.3056 118.9183 61.8140
temp: 298.150 k
press: 1.00000 atm
elementType: 8 8 8 8 8 7 7 7 7 6 6 6 6 6 6 6 6 6 6 6 6 6 6 6 6 1 1 1 1 1 1 1 1 1 1 1 1 1 1 1 1 1 1 1 1
symmnumber: 1
zpe: 921741.9 jmol-1
zpe.correction: 0.351073 hartree
zpe.thermalcorrener: 0.374114 hartree
zpe.thermalcorrenthalpy: 0.375058 hartree
zpe.thermalcorrgfe: 0.297445 hartree
zpe.sumelectzpe: -1214.767855 hartree
zpe.sumelectthermal: -1214.744815 hartree
zpe.sumelectthermalent: -1214.743870 hartree
zpe.sumelectthermalfe: -1214.821483 hartree
dipole: 9.7226 -5.5858 1.1843
dipole: 11.2753
quadrupole: -166.9764 -168.5639 -145.1744
quadrupole: -13.6479 3.7011 5.8833
quadrupole: -6.7382 -8.3257 15.0638 -13.6479 3.7011 5.8833
hfenergy: -1215.1189282 hartree
pointgroup: C01 [X(C16H20N4O5)]
dipole: 3.9670978 -1.8285653 0.7727309 debye
polarizability: 500.4685336|4.5471094|266.6778356|40.8887023|-0.472625|125.8569201 unknown
InChI: InChI=1S/C16H20N4O5/c1-11-4-2-6-14(13(11)5-3-9-21)17-18-15-8-7-12(19(22)23)10-16(15)20(24)25/h7-8,10,18,21H,2-6,9H2,1H3
charge 0 multiplicity 1
45 atoms
O  1.197421 4.532915 0.121213
O  -2.794733 2.812424 -0.639394
O  -0.604801 2.238496 -0.372778
O  -5.825199 -2.664616 -0.317077
O  -6.304423 -0.446065 -0.591299
N  0.946655 -1.381873 0.085091
N  0.095187 -0.277623 0.01658
N  -1.885576 1.921678 -0.451204
N  -5.475259 -1.421695 -0.413834
C  4.228301 -2.449209 -0.66669
C  5.177865 -1.436759 0.00071
C  3.098623 -0.124572 0.726636
C  2.965101 -2.620523 0.202066
C  4.477894 -0.2438 0.632501
C  2.253254 -1.276514 0.324452
C  2.485575 1.124439 1.362223
C  2.356001 2.337389 0.397766
C  5.417851 0.8024 1.207671
C  1.701054 3.557624 1.08688
C  -1.258171 -0.521548 -0.108395
C  -2.242117 0.521405 -0.31899
C  -1.7482 -1.870564 -0.019608
C  -3.621307 0.219199 -0.415651
C  -3.102281 -2.165529 -0.120177
C  -4.039212 -1.109107 -0.314541
H  4.736756 -3.420873 -0.803844
H  3.933685 -2.089067 -1.670763
H  5.772907 -1.938689 0.79589
H  5.926466 -1.065184 -0.727939
H  2.267599 -3.355225 -0.230984
H  3.257719 -2.978541 1.210272
H  1.494237 0.890664 1.795498
H  3.111177 1.429322 2.222829
H  1.754902 2.066655 -0.491001
H  3.348779 2.619548 0.000885
H  6.445828 0.659012 0.833398
H  5.11041 1.834018 0.966612
H  5.458059 0.730016 2.313601
H  2.441178 4.107252 1.694994
H  0.88659 3.21429 1.762396
H  0.398063 0.708301 -0.070947
H  0.398838 4.128812 -0.312601
H  -1.005108 -2.654958 0.128871
H  -4.343433 1.024786 -0.571513
H  -3.469054 -3.192911 -0.051702
