program: Gaussian 09
title: 000299065
version: EM64L-G09RevD.01
frameworkgroup: C1[X(C16H24N2O2S2)]
method: RPBEPBE
basis: SDD
operation: Freq
keyword: #p
keyword: freq=noraman
keyword: PBEPBE/SDD
title: #p freq=noraman PBEPBE/SDD
converged: YES YES NO NO
title: Mulliken charges:
elementType: S S O O N N C C C C C C C C C C C C C C C C H H H H H H H H H H H H H H H H H H H H H H H H
charge: 0.090219 0.090217 -0.220558 -0.220537 -0.092797 -0.092797 -0.358938 -0.372066 -0.358951 -0.372053 -0.002255 -0.002291 -0.650032 -0.639388 -0.650025 -0.639396 -0.126536 -0.126530 -0.160246 -0.272717 -0.272723 -0.160297 0.211561 0.258818 0.221222 0.247758 0.211563 0.258830 0.221215 0.247756 0.246581 0.208481 0.218608 0.244949 0.212569 0.217634 0.246568 0.208480 0.218610 0.244954 0.212570 0.217632 0.267034 0.250156 0.250152 0.266999
chargesum: 0.00000
title: Mulliken charges with hydrogens summed into heavy atoms:
elementType: S S O O N N C C C C C C C C C C C C C C C C
charge: 0.090219 0.090217 -0.220558 -0.220537 -0.092797 -0.092797 0.111441 0.096914 0.111442 0.096917 -0.002255 -0.002291 0.023638 0.035764 0.023632 0.035760 -0.126536 -0.126530 0.106788 -0.022561 -0.022572 0.106702
polarizability: 3.83269654e+02 5.40610718e+00 2.08879507e+02 2.43661221e-03 -5.40702231e-03 1.62585805e+02
1716.lowfreq: -3.4067 -0.0011 0.0012 0.0015 4.1097 9.0929 16.2920 17.4390 19.7570
frequency: 16.2919 17.3344 19.7325 35.5701 38.2773 48.5792 58.7409 75.5716 75.6890 82.4925 87.9904 88.4219 130.6876 131.2355 141.0245 169.3613 193.1363 215.5628 216.0214 218.5194 233.2453 254.1192 294.1379 299.1202 312.4877 317.8148 339.9315 344.0258 380.1148 404.2505 404.6644 409.5814 451.9792 458.0041 487.2139 490.7406 521.0889 532.3709 617.5511 618.0712 623.0576 632.5453 634.2354 705.9424 716.6977 770.8308 770.8732 782.0544 782.0592 822.2571 823.5998 827.5344 827.9041 939.6353 940.0066 945.5360 960.2821 993.6396 1002.6271 1003.6044 1062.8184 1071.8066 1074.1371 1078.2936 1079.9686 1079.9897 1095.4135 1095.4657 1105.4704 1106.8134 1110.9429 1190.4912 1205.9255 1206.4348 1235.2765 1237.0356 1292.4327 1295.2702 1295.4605 1340.8114 1340.8452 1355.9775 1356.4371 1356.4648 1380.7635 1382.5219 1385.0308 1386.1866 1386.3419 1389.8189 1389.9987 1458.5151 1458.5530 1460.1899 1468.3427 1468.3640 1469.5767 1469.5956 1479.7312 1479.8174 1480.8099 1480.8244 1492.2711 1492.3203 1569.1639 1578.0611 1640.5702 1642.0602 2986.3937 2986.4267 2987.0068 2987.0379 3002.3384 3002.3545 3008.6954 3008.7808 3055.0825 3055.1283 3070.7278 3070.7389 3083.7501 3083.7690 3086.5934 3086.6276 3100.1491 3100.1862 3103.1651 3103.1932 3149.9391 3150.8055 3184.7443 3187.6083
redmass: 4.8404 3.6622 3.6673 3.6422 5.0333 2.9240 3.6591 3.5351 4.2052 5.0259 3.4287 6.4189 3.9046 3.3778 5.6498 2.4201 2.3624 1.0621 1.2275 1.9941 1.3299 2.0853 4.7235 3.7424 2.8061 2.9981 3.8682 3.5898 8.6655 3.9162 3.3430 2.9620 3.8736 4.3902 3.5541 3.4083 3.3758 8.5564 9.5727 9.4490 6.9720 4.1565 4.2072 3.9268 7.4318 1.3740 1.3682 1.1910 1.1916 1.4867 1.4931 1.6407 2.0887 2.0599 2.0840 1.3585 1.3822 4.8027 2.6729 2.8121 6.4199 2.0196 2.1221 2.0127 1.9129 1.9028 1.8552 1.8608 1.9822 2.0233 1.4101 1.1236 2.9243 2.9095 1.6819 1.6677 1.2407 1.2773 1.2806 1.2649 1.2632 3.1611 1.2875 1.4504 1.9718 1.7641 2.5187 1.2736 1.4303 1.2285 1.2403 1.0824 1.0778 2.0720 1.0463 1.0489 1.0455 1.0431 1.0530 1.0515 1.0575 1.0582 1.0916 1.0926 7.5214 6.1407 9.2473 9.3205 1.0357 1.0357 1.0357 1.0357 1.0619 1.0619 1.0629 1.0629 1.1016 1.1016 1.1000 1.1000 1.0996 1.0996 1.0989 1.0989 1.1014 1.1014 1.1022 1.1022 1.0902 1.0901 1.0950 1.0961
irintensity: 0.7309 1.9782 1.8960 0.0549 1.0030 0.9413 0.0940 1.1277 1.7123 2.4301 1.5162 0.6066 0.1812 0.6811 0.5262 0.9292 0.7757 0.4305 0.3518 5.0443 2.2588 1.4719 4.0668 3.9412 0.5756 5.6682 6.6342 43.5673 1.7652 4.5636 0.9206 0.0805 5.0767 21.3679 4.7110 1.1212 22.1746 5.3038 16.7969 5.6465 0.1857 75.9788 5.3429 0.1685 2.2989 5.7791 4.0644 3.0594 1.1508 67.4957 97.9569 93.0366 32.3762 22.7005 0.1152 1.1924 1.0879 99.7373 5.5598 3.8780 13.4840 139.8543 1.8556 31.6556 0.2159 34.1649 32.6462 62.4490 205.0915 33.2356 12.0674 2.8089 100.9464 36.6766 226.7579 46.4311 1.1677 43.1885 11.8884 9.7585 0.0011 9.4093 1.1967 12.5288 206.3632 38.4682 21.6922 10.0551 15.8400 62.7818 23.1632 5.0892 35.4638 60.7923 0.1674 4.1694 20.9866 1.8327 8.1742 11.6635 3.4900 23.4127 29.5215 11.6051 1.4361 1.6707 450.0513 43.9073 56.2250 1.6338 46.8629 6.7010 30.4263 33.9494 59.5939 19.4213 22.0496 1.1587 5.1116 7.5155 18.2826 57.4960 15.0774 59.6205 49.4619 2.1475 83.6992 1.5530 8.3000 0.0096 4.5360 0.5954
temp: 298.150 k
press: 1.00000 atm
elementType: 16 16 8 8 7 7 6 6 6 6 6 6 6 6 6 6 6 6 6 6 6 6 1 1 1 1 1 1 1 1 1 1 1 1 1 1 1 1 1 1 1 1 1 1 1 1
symmnumber: 1
zpe: 982949.5 jmol-1
zpe.correction: 0.374386 hartree
zpe.thermalcorrener: 0.400433 hartree
zpe.thermalcorrenthalpy: 0.401377 hartree
zpe.thermalcorrgfe: 0.313681 hartree
zpe.sumelectzpe: -1678.501717 hartree
zpe.sumelectthermal: -1678.475670 hartree
zpe.sumelectthermalent: -1678.474726 hartree
zpe.sumelectthermalfe: -1678.562421 hartree
dipole: 0.0005 0.0006 0.5448
dipole: 0.5448
quadrupole: -77.2558 -142.6985 -151.2250
quadrupole: 6.1400 0.0030 -0.0022
quadrupole: 46.4706 -18.9721 -27.4986 6.1400 0.0030 -0.0022
hfenergy: -1678.8761026 hartree
pointgroup: C01 [X(C16H24N2O2S2)]
dipole: 0.0002153 0.2143263 -0.0003218 debye
polarizability: 383.2212362|-0.0110068|162.5858223|6.1373618|0.0282364|208.9279075 unknown
InChI: InChI=1S/C16H24N2O2S2/c1-5-17(6-2)15(19)21-13-9-11-14(12-10-13)22-16(20)18(7-3)8-4/h9-12H,5-8H2,1-4H3
charge 0 multiplicity 1
46 atoms
S  3.201963 -1.247315 -0.519806
S  -3.202119 -1.246097 0.521254
O  3.123302 0.788427 1.395576
O  -3.123168 0.787927 -1.39596
N  5.209393 0.404983 0.417683
N  -5.209415 0.405321 -0.418076
C  5.835546 1.473827 1.243615
C  6.073017 -0.310512 -0.551298
C  -5.835441 1.473435 -1.245048
C  -6.073142 -0.309214 0.551525
C  3.86348 0.169789 0.591257
C  -3.863507 0.169869 -0.591342
C  6.41708 0.932654 2.565988
C  6.122361 0.373586 -1.934105
C  -6.417217 0.931002 -2.566801
C  -6.122342 0.376039 1.933763
C  1.396351 -1.146623 -0.188168
C  -1.396495 -1.146129 0.189432
C  0.86884 -1.153011 1.122789
C  -0.530653 -1.134365 1.308316
C  0.530513 -1.136272 -1.307068
C  -0.868985 -1.154439 -1.121517
H  6.625902 1.94764 0.631977
H  5.063951 2.232918 1.454859
H  7.086701 -0.359787 -0.111181
H  5.724786 -1.353708 -0.652509
H  -6.625648 1.948043 -0.633831
H  -5.06371 2.232145 -1.45715
H  -7.086841 -0.358674 0.111466
H  -5.725096 -1.352389 0.653594
H  5.614181 0.50374 3.189201
H  7.176072 0.149727 2.384773
H  6.897505 1.750067 3.134467
H  5.118807 0.388628 -2.392186
H  6.484376 1.414453 -1.852068
H  6.805105 -0.175258 -2.60838
H  -5.614466 0.501334 -3.189685
H  -7.176294 0.148368 -2.384682
H  -6.897604 1.747902 -3.136046
H  -5.118778 0.391277 2.391814
H  -6.484168 1.416904 1.85087
H  -6.805173 -0.172124 2.608503
H  1.535758 -1.144704 1.98749
H  -0.945338 -1.110874 2.321053
H  0.945203 -1.114264 -2.319836
H  -1.535899 -1.147244 -1.986228
