program: Gaussian 09
title: 000299057
version: EM64L-G09RevD.01
frameworkgroup: C1[X(C11H13NO2S)]
method: RPBEPBE
basis: SDD
operation: Freq
keyword: #p
keyword: freq=noraman
keyword: PBEPBE/SDD
title: #p freq=noraman PBEPBE/SDD
converged: YES YES NO NO
title: Mulliken charges:
elementType: S O O N C C C C C C C C C C C H H H H H H H H H H H H H
charge: 0.105863 -0.227961 -0.222997 -0.105319 0.308845 -0.139346 -0.353216 -0.339933 -0.168254 -0.264397 0.124856 0.028372 -0.605706 -0.618193 -0.789534 0.243278 0.279592 0.270526 0.253340 0.260195 0.245753 0.230609 0.232079 0.278719 0.235489 0.240264 0.237122 0.259955
chargesum: 0.00000
title: Mulliken charges with hydrogens summed into heavy atoms:
elementType: S O O N C C C C C C C C C C C
charge: 0.105863 -0.227961 -0.222997 -0.105319 0.308845 -0.139346 -0.109938 -0.060342 0.102272 -0.011057 0.124856 0.028372 0.130852 0.128094 -0.052194
polarizability: 2.64355855e+02 -2.06514492e+00 1.37721573e+02 7.37196559e+00 7.75575898e+00 8.59553832e+01
1716.lowfreq: -7.7414 -0.0020 0.0010 0.0019 3.9290 5.5353 27.6346 30.8527 51.3757
frequency: 27.6075 30.8176 51.3627 74.7697 93.1275 108.6404 116.5685 123.9790 157.3318 169.1478 206.0932 239.8388 256.8313 280.1935 332.5438 356.2749 402.5894 403.9883 435.8831 444.6176 478.9591 521.2307 591.6907 603.2523 604.7339 625.7403 651.1323 729.1881 745.8735 828.5271 857.0146 876.7459 946.4026 960.5518 992.6407 1001.9002 1026.9788 1054.9693 1060.9102 1073.7290 1087.2371 1092.0872 1116.4834 1137.8663 1191.9358 1237.3738 1273.0350 1298.7568 1347.2204 1362.1603 1372.6850 1400.7441 1420.2738 1442.9122 1448.2600 1462.6527 1470.9449 1474.7979 1477.0194 1485.1979 1493.2670 1557.9934 1589.8862 1607.2559 1652.3783 2974.3111 2979.2352 2985.8864 3056.3565 3063.3359 3070.3527 3100.5013 3125.9214 3128.8555 3144.8508 3149.9867 3165.1609 3190.0726
redmass: 5.8265 3.9880 4.0740 4.7098 1.3481 3.3750 3.8116 1.1697 1.0351 5.7014 3.5296 3.1559 5.0301 4.8058 6.1073 4.3736 3.7875 2.9279 3.9976 3.9463 4.2867 6.7142 2.4697 4.3312 11.3023 7.0948 5.9472 3.5918 6.0625 1.3665 1.3333 4.9812 2.1922 1.3651 1.3637 3.9131 1.8362 1.7035 2.5040 2.0428 2.0390 1.2601 1.3629 1.3801 1.1405 5.3622 3.7978 1.2652 3.2154 2.2139 1.8085 4.0191 1.1530 1.1647 1.1033 1.0497 1.0505 1.1642 1.8822 1.0483 1.1174 6.8508 6.6941 7.2005 9.0400 1.0362 1.0365 1.0374 1.1020 1.0990 1.0968 1.1000 1.0993 1.0980 1.0882 1.0894 1.0967 1.0951
irintensity: 0.4907 5.1576 3.1695 3.5997 0.6817 1.5424 2.9092 0.5681 0.4613 2.6688 0.9540 5.0279 1.6108 1.1269 11.5713 29.4806 4.4229 1.1976 4.5930 1.1070 12.6791 11.7845 15.0780 9.3364 8.8559 0.7686 55.2493 1.3478 12.0977 30.8949 35.9634 46.9109 46.3210 1.3956 1.3659 43.3048 0.9172 109.0179 58.4542 176.3982 64.8162 10.4120 10.5571 1.7294 16.5510 57.6373 263.6242 1.3503 139.9180 8.4039 60.6451 35.9670 32.6615 5.7946 33.5880 20.8049 19.0076 25.3932 3.5911 28.1162 26.2433 76.4078 158.8424 32.1785 261.0351 29.3330 106.6752 3.2988 39.1554 18.7716 12.3456 16.7286 19.9399 2.0359 1.3273 9.0738 4.9387 1.5951
temp: 298.150 k
press: 1.00000 atm
elementType: 16 8 8 7 6 6 6 6 6 6 6 6 6 6 6 1 1 1 1 1 1 1 1 1 1 1 1 1
symmnumber: 1
zpe: 569300.6 jmol-1
zpe.correction: 0.216835 hartree
zpe.thermalcorrener: 0.233142 hartree
zpe.thermalcorrenthalpy: 0.234086 hartree
zpe.thermalcorrgfe: 0.171133 hartree
zpe.sumelectzpe: -1029.125977 hartree
zpe.sumelectthermal: -1029.109670 hartree
zpe.sumelectthermalent: -1029.108726 hartree
zpe.sumelectthermalfe: -1029.171679 hartree
dipole: 5.9599 1.0205 1.2900
dipole: 6.1827
quadrupole: -83.4815 -92.4402 -98.1780
quadrupole: -11.6456 -6.8864 3.2414
quadrupole: 7.8851 -1.0736 -6.8114 -11.6456 -6.8864 3.2414
hfenergy: -1029.3428121 hartree
pointgroup: C01 [X(C11H13N1O2S1)]
dipole: 2.3324792 0.5445439 0.4242023 debye
polarizability: 264.3884675|2.8107798|138.9094089|6.4789122|-0.3564264|84.7349343 unknown
InChI: InChI=1S/C11H13NO2S/c1-8(13)9-4-6-10(7-5-9)15-11(14)12(2)3/h4-7H,1-3H3
charge 0 multiplicity 1
28 atoms
S  1.906327 -0.927131 0.917168
O  -4.842602 -0.931593 -0.314207
O  2.133974 1.496011 -0.456192
N  4.143981 0.374245 -0.036427
C  -2.642146 -0.126082 0.247659
C  0.138393 -0.544432 0.603289
C  -1.796016 0.938264 0.659734
C  -2.069782 -1.406613 0.015526
C  -0.413755 0.7344 0.846785
C  -0.689371 -1.616426 0.183694
C  -4.121984 0.046132 0.046447
C  2.774184 0.523492 0.011817
C  4.886361 -0.766018 0.526588
C  4.951635 1.471171 -0.61069
C  -4.742144 1.419614 0.284641
H  -2.210193 1.93474 0.844374
H  -2.730749 -2.218045 -0.306175
H  0.229061 1.557737 1.164308
H  -0.249328 -2.599436 -0.012974
H  4.27243 -1.680749 0.511748
H  5.209896 -0.570329 1.567107
H  5.782368 -0.94816 -0.092371
H  5.649288 1.873446 0.148157
H  4.276899 2.27253 -0.945057
H  5.535574 1.103651 -1.474854
H  -4.29591 2.177288 -0.386237
H  -4.5728 1.757361 1.324056
H  -5.824592 1.362637 0.095589
