program: Gaussian 09
title: 000299034
version: EM64L-G09RevD.01
frameworkgroup: C1[X(C13H19NOS)]
method: RPBEPBE
basis: SDD
operation: Freq
keyword: #p
keyword: freq=noraman
keyword: PBEPBE/SDD
title: #p freq=noraman PBEPBE/SDD
converged: YES YES NO NO
title: Mulliken charges:
elementType: S O N C C C C C C C C C C C C C H H H H H H H H H H H H H H H H H H H
charge: 0.006724 -0.310576 -0.037647 0.135592 0.505807 -0.695752 -0.699221 -0.747729 -0.377232 -0.397920 -0.359090 -0.416124 0.413865 -0.192484 -0.645306 -0.605742 0.206055 0.216754 0.225860 0.215128 0.207614 0.222124 0.216703 0.217706 0.215482 0.227522 0.248633 0.259727 0.246545 0.234517 0.287547 0.232974 0.263434 0.262772 0.215735
chargesum: 0.00000
title: Mulliken charges with hydrogens summed into heavy atoms:
elementType: S O N C C C C C C C C C C C C C
charge: 0.006724 -0.310576 -0.037647 0.135592 0.505807 -0.047082 -0.054355 -0.097838 -0.149711 -0.149286 -0.099363 -0.169579 0.413865 -0.192484 0.109732 0.136199
polarizability: 2.42825834e+02 -9.47666314e+00 1.50495832e+02 4.56949333e+00 6.37163964e+00 1.24228999e+02
1716.lowfreq: -14.4549 -8.7466 -1.2432 -0.0015 -0.0012 0.0013 18.0471 29.1922 36.5581
frequency: 17.1817 28.8545 36.2663 43.6818 64.8711 100.8158 111.6822 121.3231 191.2592 194.2501 199.9500 240.8307 247.1479 258.2350 281.9956 307.9060 316.6380 341.9118 367.0644 373.1574 411.4129 416.7264 433.2705 459.7048 500.7388 528.7684 558.1434 581.9392 618.9296 643.0027 687.1012 736.7692 811.0468 825.2251 838.8482 839.7427 916.4562 931.0912 931.7223 939.4788 950.1688 962.8220 1006.3472 1019.0958 1024.0804 1050.8745 1074.6459 1090.5424 1109.8055 1115.6634 1137.7743 1155.8562 1170.2601 1202.5315 1206.4942 1216.0330 1259.5696 1272.5049 1301.3910 1366.1495 1372.8486 1375.2834 1396.1717 1403.0195 1404.8424 1424.9233 1449.0318 1459.2180 1462.0541 1463.5956 1467.8004 1478.0304 1479.0278 1486.4417 1488.5404 1493.0153 1499.7034 1519.3177 1592.3593 1612.0103 2971.6832 2972.8488 2975.7690 2978.0211 2988.7440 3050.8662 3066.9516 3068.9823 3069.2437 3074.0918 3076.7833 3077.7310 3081.6230 3105.8767 3130.8343 3150.5913 3152.9181 3169.7647 3173.7774
redmass: 3.8173 2.6650 1.5619 3.5070 3.3563 1.7057 4.4402 1.4298 3.4669 1.6319 2.0183 2.6039 2.7737 1.1469 3.8453 2.8720 1.0550 2.7214 2.8849 3.6305 3.0701 3.2507 3.3348 3.0415 3.9020 3.2925 3.0018 9.4997 6.0273 6.9295 5.4252 3.6677 4.4034 1.2957 2.0650 2.1346 1.7460 1.8348 3.0333 1.2203 1.3480 1.3705 2.8529 1.4368 1.3868 1.4896 8.3766 1.2226 1.9902 1.5512 1.3648 1.8612 1.8148 1.7102 3.0043 2.6914 4.8212 3.2326 1.2820 4.7997 1.1890 1.3020 1.8907 1.2419 3.1028 1.1311 1.0426 1.0510 1.1449 1.0526 1.0770 1.0964 1.0498 1.0474 1.0517 1.5129 1.3248 1.8669 7.3745 6.4219 1.0348 1.0348 1.0373 1.0358 1.0339 1.1019 1.1002 1.0998 1.1005 1.1012 1.0985 1.0994 1.0992 1.1017 1.0889 1.0876 1.0956 1.0953 1.0962
irintensity: 0.6323 2.7728 0.6549 1.0782 1.0403 0.1738 1.0729 0.0720 0.5659 0.5951 1.1235 2.0233 4.5080 0.6427 3.3459 1.4375 0.0508 0.1212 1.4733 0.7115 0.4495 0.9611 7.0230 0.3771 4.6795 12.5485 7.0669 1.9718 6.8381 2.8652 1.3378 0.7355 21.9964 2.6452 22.1942 21.1406 2.6021 2.6127 0.1361 0.1718 1.9794 0.8227 40.8332 9.6260 0.1340 125.4210 279.8773 0.2926 14.7759 7.3975 1.2334 57.6195 221.1969 117.2904 5.8972 2.7735 57.2669 56.8684 1.2249 2.0682 19.3567 23.9919 116.4113 7.9394 6.5073 11.6277 18.5568 0.1542 22.9282 1.4842 4.4456 20.4556 15.7466 11.2241 11.6224 44.5112 137.3805 201.4740 2.1305 4.5924 33.2588 31.3406 58.5705 30.9821 65.2738 30.7992 3.3930 7.3516 16.8230 16.8356 118.3899 47.7643 44.2549 22.5936 20.4151 8.2763 2.4027 13.5785 1.4496
temp: 298.150 k
press: 1.00000 atm
elementType: 16 8 7 6 6 6 6 6 6 6 6 6 6 6 6 6 1 1 1 1 1 1 1 1 1 1 1 1 1 1 1 1 1 1 1
symmnumber: 1
zpe: 764486.0 jmol-1
zpe.correction: 0.291177 hartree
zpe.thermalcorrener: 0.309405 hartree
zpe.thermalcorrenthalpy: 0.310349 hartree
zpe.thermalcorrgfe: 0.242815 hartree
zpe.sumelectzpe: -1033.591302 hartree
zpe.sumelectthermal: -1033.573074 hartree
zpe.sumelectthermalent: -1033.572130 hartree
zpe.sumelectthermalfe: -1033.639665 hartree
dipole: 1.0703 -2.7696 1.1600
dipole: 3.1877
quadrupole: -77.4637 -107.0940 -103.5664
quadrupole: -9.3440 4.1090 4.8671
quadrupole: 18.5777 -11.0526 -7.5250 -9.3440 4.1090 4.8671
hfenergy: -1033.8824794 hartree
pointgroup: C01 [X(C13H19N1O1S1)]
dipole: 0.4500405 -1.1583119 -0.1693486 debye
polarizability: 243.1856153|-8.7948227|137.1888683|1.9629676|14.3013571|137.1761819 unknown
InChI: InChI=1S/C13H19NOS/c1-13(2,3)10-6-8-11(9-7-10)15-12(16)14(4)5/h6-9H,1-5H3
charge 0 multiplicity 1
35 atoms
S  2.606083 1.988916 0.58344
O  2.01332 -0.575903 -0.282328
N  4.223453 -0.16562 0.109186
C  -3.753629 0.101959 -0.019267
C  -2.217104 -0.057309 -0.110595
C  -4.089329 1.523054 0.527081
C  -4.33028 -0.972715 0.951404
C  -4.447421 -0.065335 -1.39524
C  -1.424122 0.054614 1.066396
C  -1.541794 -0.308536 -1.331695
C  -0.022261 -0.075686 1.036326
C  -0.134495 -0.437837 -1.384088
C  0.610453 -0.318537 -0.199747
C  2.965618 0.379459 0.139347
C  4.50834 -1.559852 -0.289653
C  5.37524 0.686126 0.464276
H  -5.185101 1.653341 0.608368
H  -3.652385 1.689518 1.527851
H  -3.694956 2.305379 -0.146747
H  -3.897713 -0.883888 1.964025
H  -5.427061 -0.85797 1.040208
H  -4.116999 -1.99211 0.580567
H  -5.53961 0.055537 -1.275488
H  -4.105429 0.694727 -2.121879
H  -4.266934 -1.067657 -1.82618
H  -1.90561 0.249303 2.03139
H  -2.106255 -0.403222 -2.263499
H  0.572131 0.019637 1.948979
H  0.383587 -0.626866 -2.329345
H  5.141622 -1.576639 -1.196936
H  3.567934 -2.083879 -0.499529
H  5.042432 -2.084074 0.524842
H  5.260105 1.089452 1.485618
H  5.453755 1.546412 -0.224195
H  6.292316 0.077499 0.404605
