program: Gaussian 09
title: 000299033
version: EM64L-G09RevD.01
frameworkgroup: C1[X(C13H19NOS)]
method: RPBEPBE
basis: SDD
operation: Freq
keyword: #p
keyword: freq=noraman
keyword: PBEPBE/SDD
title: #p freq=noraman PBEPBE/SDD
converged: YES YES NO NO
title: Mulliken charges:
elementType: S O N C C C C C C C C C C C C C H H H H H H H H H H H H H H H H H H H
charge: 0.000942 -0.314013 -0.032711 -0.348912 -0.349483 -0.236884 0.457301 0.504346 0.507038 -0.654733 -0.646059 -0.485990 -0.548496 -0.633368 -0.811224 -0.812831 0.252520 0.211464 0.256542 0.210194 0.212701 0.245331 0.217266 0.205744 0.251957 0.218008 0.262896 0.251911 0.235561 0.225592 0.223523 0.236387 0.225825 0.221775 0.239881
chargesum: 0.00000
title: Mulliken charges with hydrogens summed into heavy atoms:
elementType: S O N C C C C C C C C C C C C C
charge: 0.000942 -0.314013 -0.032711 0.115072 0.117253 -0.236884 0.457301 0.504346 0.507038 0.020566 0.029650 -0.223094 -0.296585 -0.397807 -0.125723 -0.125350
polarizability: 2.21643954e+02 -2.38436935e+00 1.71950587e+02 8.19310818e+00 1.07665635e+00 1.23772083e+02
1716.lowfreq: -23.6094 -8.4371 -1.6369 -0.0022 -0.0018 0.0008 3.0510 13.2185 19.9136
frequency: -22.9067 10.6286 19.5669 29.0878 52.4822 66.4720 77.0495 85.9515 127.8442 181.8892 196.5714 213.3881 216.7398 230.2030 237.6202 274.2172 286.4895 302.2745 339.6082 398.1665 453.3617 478.4863 501.4988 514.6779 519.9948 527.5489 543.2138 602.7822 645.6109 664.2479 696.1500 774.9029 779.6078 857.4954 866.3174 876.8467 903.6608 921.9110 950.6716 953.2620 988.5981 1009.0643 1015.6103 1025.6190 1046.0677 1050.2698 1069.1714 1074.5554 1080.7276 1098.4166 1134.1486 1154.7913 1174.8246 1216.5362 1274.9875 1280.5229 1297.7722 1307.9643 1345.6668 1358.7981 1379.8605 1381.7682 1384.5455 1396.0409 1397.3009 1426.5525 1434.9705 1455.0129 1458.7684 1465.7100 1468.1829 1470.4610 1471.4588 1481.5625 1483.2754 1483.5621 1485.1536 1503.0546 1600.7431 1625.1808 2976.8398 2977.4289 2985.6591 2986.9158 3001.1922 3013.4891 3056.5011 3057.5066 3065.1975 3075.3152 3084.4562 3085.1087 3085.3248 3092.4953 3100.6527 3107.4415 3120.9716 3150.1932 3157.0730
redmass: 1.0336 1.1872 2.4712 3.9622 3.9358 3.1097 3.9621 3.5498 3.5391 2.7708 2.0463 1.0475 3.0528 1.8108 3.0852 2.8272 4.0025 3.2396 2.7980 3.5504 3.2711 3.1827 4.9682 3.7002 3.1790 4.7237 4.1752 7.1367 6.8555 4.8008 2.0994 1.2375 1.1795 2.2548 1.5477 1.3242 1.4101 2.4560 3.4244 2.1546 6.1860 2.1001 1.4790 2.5930 1.5375 1.5998 3.6382 2.1952 1.9132 1.9156 1.6848 1.9964 1.3969 2.7512 1.3248 1.2645 2.2770 2.0761 1.2436 1.2863 5.7672 1.2128 1.2137 1.2699 1.2626 2.1941 1.6410 1.7000 1.2358 1.0450 1.0531 1.0552 1.0518 1.0579 1.2607 1.1088 1.2566 1.6827 6.0905 6.7577 1.0375 1.0373 1.0355 1.0356 1.0621 1.0650 1.0969 1.0970 1.1006 1.0995 1.0998 1.0991 1.0992 1.0973 1.1017 1.1023 1.0915 1.0926 1.0929
irintensity: 0.3645 0.4014 0.3264 1.9912 1.4594 0.4849 0.4327 2.5887 0.1944 1.7212 1.0523 0.3950 0.1693 0.8870 2.5653 0.3707 1.3361 0.8105 4.3958 7.5043 0.6682 3.1068 0.2746 2.2343 0.4240 0.9181 1.0333 4.9708 6.5073 2.7485 15.7739 11.3265 9.7251 3.5890 22.7733 6.3743 0.5573 17.6400 6.0198 39.5369 9.1044 20.3724 5.5460 2.1539 1.3054 19.7784 378.2151 8.4668 19.8190 3.4883 112.5732 71.5314 0.8019 94.2591 120.1618 26.9613 56.3998 31.5962 5.9187 13.7619 2.5869 7.1418 31.6813 11.1875 13.5317 43.3817 118.6006 4.3120 22.4635 5.1939 2.7736 5.0866 21.4945 7.5568 12.5991 21.4747 79.8394 181.3554 69.9199 50.5441 47.8193 23.0166 30.4915 27.2138 40.6790 44.1818 16.8388 23.3655 2.2578 14.1735 42.2754 4.8760 33.3246 28.8264 19.1574 37.4239 23.4355 4.3363 3.3049
temp: 298.150 k
press: 1.00000 atm
elementType: 16 8 7 6 6 6 6 6 6 6 6 6 6 6 6 6 1 1 1 1 1 1 1 1 1 1 1 1 1 1 1 1 1 1 1
symmnumber: 1
zpe: 764506.7 jmol-1
zpe.correction: 0.291185 hartree
zpe.thermalcorrener: 0.309013 hartree
zpe.thermalcorrenthalpy: 0.309957 hartree
zpe.thermalcorrgfe: 0.241817 hartree
zpe.sumelectzpe: -1033.605210 hartree
zpe.sumelectthermal: -1033.587381 hartree
zpe.sumelectthermalent: -1033.586437 hartree
zpe.sumelectthermalfe: -1033.654578 hartree
dipole: -1.1606 1.8586 -2.3892
dipole: 3.2418
quadrupole: -82.6912 -99.9820 -108.4036
quadrupole: -3.4426 4.0606 5.0695
quadrupole: 14.3344 -2.9564 -11.3780 -3.4426 4.0606 5.0695
hfenergy: -1033.8963948 hartree
pointgroup: C01 [X(C13H19N1O1S1)]
dipole: -0.4711261 -0.5331235 1.0585534 debye
polarizability: 221.4444993|-1.4623503|170.8534425|-9.7311882|-6.9321305|125.0686832 unknown
InChI: InChI=1S/C13H19NOS/c1-5-14(6-2)13(16)15-12-8-10(3)7-11(4)9-12/h7-9H,5-6H2,1-4H3
charge 0 multiplicity 1
35 atoms
S  -1.216819 1.148344 -1.851432
O  -0.590719 -0.447899 0.321078
N  -2.807531 -0.02355 0.064747
C  -3.01643 -0.819734 1.304921
C  -4.018913 0.495021 -0.617555
C  -1.564767 0.221793 -0.457207
C  0.807562 -0.21771 0.123083
C  3.002376 -1.193876 -0.281951
C  2.77079 1.213266 0.266054
C  -3.16355 -2.329636 1.021226
C  -4.409795 1.904918 -0.129378
C  1.367473 1.051022 0.359709
C  1.59526 -1.338006 -0.191025
C  3.569647 0.083827 -0.048444
C  3.875495 -2.384756 -0.639369
C  3.398735 2.578842 0.48712
H  -2.16677 -0.645342 1.983106
H  -3.928232 -0.425926 1.791276
H  -3.81466 0.518722 -1.70181
H  -4.836595 -0.225988 -0.430047
H  -4.001175 -2.53004 0.32869
H  -2.236706 -2.72511 0.573184
H  -3.357723 -2.876864 1.961914
H  -4.596222 1.919921 0.960115
H  -3.602167 2.619451 -0.362215
H  -5.330103 2.241434 -0.640558
H  0.719296 1.899468 0.600027
H  1.111058 -2.305094 -0.362921
H  4.658408 0.203511 -0.114054
H  3.6110 -3.275835 -0.041137
H  4.943984 -2.166233 -0.470574
H  3.755658 -2.659794 -1.704893
H  2.999209 3.066401 1.395086
H  4.494971 2.507702 0.59268
H  3.187052 3.253049 -0.364752
