program: Gaussian 09
title: 000299055
version: EM64L-G09RevD.01
frameworkgroup: C1[X(C18H29NOS)]
method: RPBEPBE
basis: SDD
operation: Freq
keyword: #p
keyword: freq=noraman
keyword: PBEPBE/SDD
title: #p freq=noraman PBEPBE/SDD
converged: YES YES NO NO
title: Mulliken charges:
elementType: S O N C C C C C C C C C C C C C C C C C C H H H H H H H H H H H H H H H H H H H H H H H H H H H H H
charge: 0.074577 -0.216661 -0.101684 0.131173 0.133255 0.617475 0.618305 -0.692149 -0.614310 -0.618053 -0.703302 -0.716854 -0.760687 -0.761739 -0.704561 -0.717370 0.469761 -0.832273 -0.003356 -0.622046 -0.637246 0.261226 0.261371 0.228759 0.236971 0.200560 0.242837 0.201956 0.215731 0.220202 0.218563 0.219451 0.220301 0.219777 0.218592 0.238634 0.200915 0.227546 0.202096 0.215820 0.242642 0.222988 0.237198 0.223016 0.230595 0.253359 0.253236 0.279566 0.231953 0.231884
chargesum: 0.00000
title: Mulliken charges with hydrogens summed into heavy atoms:
elementType: S O N C C C C C C C C C C C C C C C C C C
charge: 0.074577 -0.216661 -0.101684 0.131173 0.133255 0.617475 0.618305 -0.692149 -0.353084 -0.356683 -0.037012 -0.056331 -0.102471 -0.103068 -0.037466 -0.056812 0.469761 -0.149072 -0.003356 0.115144 0.106157
polarizability: 2.71990206e+02 -4.34880601e-02 2.34096246e+02 1.15408872e+01 -1.30144272e-01 1.79047121e+02
1716.lowfreq: -47.4136 -7.2992 0.0016 0.0019 0.0024 8.1459 10.1280 13.9931 31.3919
frequency: -47.4006 3.4993 31.3296 34.4231 56.6106 70.7700 79.7817 82.2376 118.7864 139.1008 147.9208 148.4598 155.6131 188.5959 194.1701 215.3898 219.1292 224.9442 229.3777 240.7945 256.3612 266.0068 273.9709 286.0615 314.0365 318.6693 344.1307 358.5636 364.4592 387.9155 388.8274 392.7577 397.3775 409.4096 420.3282 426.8550 438.3963 482.1518 520.9811 552.3488 573.1096 578.3155 609.9768 620.6608 644.3177 654.1477 742.7041 778.1925 802.2150 874.2606 875.7995 879.7513 904.1676 918.3293 920.0009 925.6465 926.5667 938.2619 941.5423 942.2597 1003.4080 1010.9817 1023.3042 1027.3446 1029.6519 1030.7348 1048.8333 1055.0449 1077.2285 1093.1501 1134.0106 1142.0392 1189.5440 1200.4982 1202.5713 1203.1115 1212.1615 1227.4892 1248.4250 1251.6833 1284.8413 1319.5298 1332.3447 1370.0533 1370.7363 1373.3151 1373.5916 1393.6223 1396.9635 1399.2851 1406.0001 1410.5116 1420.5821 1443.8422 1456.3776 1457.0852 1467.1711 1468.1517 1470.7291 1472.2106 1472.8154 1475.3867 1475.9800 1479.9612 1480.1812 1481.1605 1487.6655 1489.7094 1496.7526 1497.0920 1504.8538 1506.2848 1574.1418 1602.4844 1646.6584 2972.2502 2972.4443 2972.4897 2972.6804 2974.9769 2975.2966 2978.5907 2984.3800 2984.7366 3052.8932 3053.4051 3056.0645 3061.4210 3061.7398 3069.2203 3069.5707 3072.6476 3072.9871 3077.3369 3077.8241 3081.4175 3100.5212 3100.9761 3103.3819 3118.4645 3119.7607 3122.8797 3168.3182 3171.6257
redmass: 1.1247 1.0115 3.9787 3.6937 3.1843 3.5689 2.7181 3.2397 3.8990 2.2970 1.3071 1.8363 4.0764 2.0702 1.5080 1.9661 2.0727 1.4785 1.0614 2.2142 2.7251 3.2210 3.2337 2.9923 2.6009 2.6384 3.8305 1.3489 1.1933 2.5219 4.4545 1.8071 4.7316 1.9651 2.7910 2.9259 3.3905 5.4400 2.9330 2.5280 3.7645 3.0504 10.9320 5.7394 4.4810 5.8843 5.1285 3.4444 3.1038 4.9435 2.5173 1.5576 1.4473 1.8582 1.7293 1.7404 1.6784 2.8315 1.2083 1.2968 1.4050 7.0058 1.3874 1.3574 1.3609 1.3570 1.5861 1.4504 2.0205 1.2223 1.3463 2.3042 2.2346 2.8700 3.0062 2.9936 2.7282 1.7527 5.1889 1.9855 4.1514 9.5542 3.1762 1.2065 1.2342 1.1767 1.1771 1.9687 1.2256 1.2105 1.5655 2.0825 1.1536 1.1767 1.0512 1.0540 1.0575 1.0573 1.0725 1.0877 1.0556 1.0554 1.0500 1.0560 1.0558 1.0591 1.0455 1.0877 1.0512 1.0512 1.0561 1.0608 6.8583 5.0394 8.8777 1.0356 1.0359 1.0353 1.0377 1.0365 1.0366 1.0359 1.0390 1.0390 1.1025 1.0951 1.1020 1.0995 1.0994 1.0987 1.0987 1.0999 1.0998 1.0978 1.0977 1.0997 1.0974 1.0973 1.0990 1.0965 1.0964 1.0977 1.0888 1.0899
irintensity: 0.1928 0.3594 3.2740 0.4097 0.9325 2.1223 0.1607 0.9702 1.9738 0.0040 0.0420 0.0582 1.3478 0.0426 0.0624 0.3890 0.3993 1.1907 0.0983 4.3113 0.0244 0.3124 2.2897 0.1789 0.0173 0.6733 26.3457 0.5727 0.0244 1.1716 2.2270 0.4201 3.2518 0.0336 0.3140 0.4139 1.7871 4.1541 0.0316 0.3922 0.2307 2.7570 7.4838 4.5889 0.0184 29.0518 0.0008 10.6060 0.8470 32.4215 16.3016 15.1288 0.0034 4.3496 7.9640 5.5123 0.6935 3.7172 0.0073 0.0664 3.1627 49.7777 0.9112 1.1087 0.1492 0.8509 12.9652 18.2466 267.0398 0.0849 0.0661 0.7214 0.5119 8.3504 0.3019 8.8167 48.9054 3.1193 33.1058 45.0165 5.6523 6.1740 109.5139 3.4609 21.8455 0.3620 51.4516 22.6550 7.6492 27.3988 6.3399 18.2176 35.3854 10.3310 0.4527 2.0290 1.4795 36.4946 7.7523 12.2067 11.8231 0.0623 1.2645 6.9081 0.4765 1.9031 8.4117 72.6433 0.0076 14.3344 41.0289 3.5507 12.5133 36.4943 177.9775 9.8329 61.7552 60.9155 17.0072 32.4462 53.4207 54.0099 80.8625 20.2065 32.2614 21.0117 19.3074 17.3649 14.8073 4.5655 11.1749 19.9065 59.7457 131.7301 41.6509 16.5865 16.2385 14.8166 25.3024 17.7931 25.3844 2.1709 7.6250 14.8565
temp: 298.150 k
press: 1.00000 atm
elementType: 16 8 7 6 6 6 6 6 6 6 6 6 6 6 6 6 6 6 6 6 6 1 1 1 1 1 1 1 1 1 1 1 1 1 1 1 1 1 1 1 1 1 1 1 1 1 1 1 1 1
symmnumber: 1
zpe: 1124491.8 jmol-1
zpe.correction: 0.428296 hartree
zpe.thermalcorrener: 0.453215 hartree
zpe.thermalcorrenthalpy: 0.454159 hartree
zpe.thermalcorrgfe: 0.372689 hartree
zpe.sumelectzpe: -1229.704529 hartree
zpe.sumelectthermal: -1229.679610 hartree
zpe.sumelectthermalent: -1229.678666 hartree
zpe.sumelectthermalfe: -1229.760136 hartree
dipole: 2.2968 -0.0165 0.6275
dipole: 2.3810
quadrupole: -110.6609 -132.2377 -142.4249
quadrupole: -0.0789 2.5333 0.0008
quadrupole: 17.7802 -3.7965 -13.9837 -0.0789 2.5333 0.0008
hfenergy: -1230.1328253 hartree
pointgroup: C01 [X(C18H29N1O1S1)]
dipole: -0.9070299 -0.0072887 0.2340773 debye
polarizability: 272.292835|0.5419841|234.0782925|-10.2238059|1.0796066|178.7624457 unknown
InChI: InChI=1S/C18H29NOS/c1-12-10-13(17(2,3)4)15(21-16(20)19(8)9)14(11-12)18(5,6)7/h10-11H,1-9H3
charge 0 multiplicity 1
50 atoms
S  -1.382962 -0.020483 0.964116
O  -1.643232 0.01405 -1.81567
N  -3.643859 -0.012984 -0.594764
C  0.448412 2.664754 0.563926
C  0.475279 -2.673868 0.467943
C  1.032266 1.264403 0.171249
C  1.043587 -1.254035 0.124716
C  0.381297 -0.002066 0.374217
C  2.333572 1.230436 -0.392745
C  2.343849 -1.186706 -0.438958
C  -0.82182 3.027288 -0.267482
C  0.136148 2.711579 2.092814
C  1.46998 3.813009 0.303147
C  1.507088 -3.801115 0.159154
C  -0.796181 -3.019645 -0.369316
C  0.172346 -2.779193 1.995656
C  2.988028 0.030637 -0.733178
C  4.352448 0.049515 -1.399497
C  -2.267973 -0.00333 -0.727979
C  -4.325632 -0.032974 0.713199
C  -4.47504 -0.003306 -1.815574
H  2.860699 2.16764 -0.582231
H  2.878706 -2.111176 -0.665356
H  -1.698733 2.438774 0.039262
H  -0.650195 2.852242 -1.344255
H  -1.061819 4.097694 -0.120368
H  -0.619754 1.966411 2.386109
H  -0.249492 3.713862 2.361454
H  1.054117 2.527548 2.681651
H  1.022976 4.761797 0.651403
H  2.414718 3.668064 0.858496
H  1.701848 3.932936 -0.771303
H  1.071488 -4.766663 0.474285
H  1.733702 -3.878066 -0.920373
H  2.453712 -3.667948 0.714244
H  -0.638992 -2.787933 -1.437542
H  -1.014272 -4.10053 -0.273855
H  -1.681412 -2.464825 -0.025394
H  -0.20054 -3.794762 2.230179
H  1.091477 -2.605993 2.585933
H  -0.589941 -2.05323 2.319204
H  4.936888 -0.855551 -1.156489
H  4.252145 0.088978 -2.501971
H  4.942912 0.931417 -1.093552
H  -5.413958 -0.03524 0.541847
H  -4.070032 0.856702 1.318009
H  -4.062586 -0.935949 1.29474
H  -3.807901 0.009789 -2.690368
H  -5.121061 0.894464 -1.839704
H  -5.112201 -0.906616 -1.859827
