program: Gaussian 09
title: 000299024
version: EM64L-G09RevD.01
frameworkgroup: C1[X(C11H12N2O7)]
method: RPBEPBE
basis: SDD
operation: Freq
keyword: #p
keyword: freq=noraman
keyword: PBEPBE/SDD
title: #p freq=noraman PBEPBE/SDD
converged: YES YES NO NO
title: Mulliken charges:
elementType: O O O O O O O N N C C C C C C C C C C C H H H H H H H H H H H H
charge: -0.215706 -0.238423 -0.241374 -0.192648 -0.165723 -0.203068 -0.198095 0.010221 0.020257 -0.132247 0.283249 0.263799 -0.699580 -0.285298 0.275689 -0.478660 0.428571 -0.404613 -0.259772 -0.661696 0.253671 0.219188 0.242071 0.265721 0.303818 0.331782 0.295317 0.236938 0.237733 0.228048 0.248198 0.232633
chargesum: 0.00000
title: Mulliken charges with hydrogens summed into heavy atoms:
elementType: O O O O O O O N N C C C C C C C C C C C
charge: -0.215706 -0.238423 -0.241374 -0.192648 -0.165723 -0.203068 -0.198095 0.010221 0.020257 0.121424 0.283249 0.263799 0.027399 0.018520 0.275689 -0.146878 0.428571 -0.109295 0.214898 0.047184
polarizability: 2.38634584e+02 -1.76191966e+01 1.79584666e+02 -9.36129713e+00 -1.13077594e+01 1.04706875e+02
1716.lowfreq: -4.1215 -1.9575 0.0003 0.0006 0.0007 4.4360 9.8592 31.7181 35.0449
frequency: 9.1594 31.6425 35.0190 40.6799 55.9499 72.6455 87.5294 99.4833 120.8156 149.7767 152.1552 175.4611 183.5091 222.2959 227.1610 264.8931 276.1985 304.5665 313.1452 326.6071 365.3867 393.5385 427.3875 445.1803 496.2840 504.7739 520.6291 588.5939 615.7167 634.1869 656.2679 671.9910 711.3700 720.4748 743.4302 752.7218 755.8798 761.4480 815.8299 848.7055 854.4743 871.0227 905.9675 952.1974 989.4825 994.0231 1020.3222 1053.6053 1057.0804 1096.5477 1114.3150 1137.9949 1157.4619 1160.0593 1203.3827 1217.4010 1227.2966 1240.9504 1274.0956 1275.6172 1305.1926 1335.9222 1356.3297 1358.9663 1373.8104 1393.1626 1396.3570 1400.1709 1430.8407 1456.9361 1462.2134 1463.1975 1470.6545 1476.3291 1483.3068 1584.3146 1607.8740 1614.8442 2996.9236 3007.7653 3031.5199 3036.6393 3092.7251 3100.0837 3104.2019 3128.3637 3131.4145 3162.6269 3186.9525 3188.8694
redmass: 4.7745 5.5707 4.0260 9.9805 12.1741 5.7472 3.9338 6.4652 6.0360 10.3604 5.2298 1.9885 4.3822 1.2290 1.4458 3.6490 5.3236 7.0839 3.8413 8.5816 6.4395 6.7823 3.7731 4.7503 5.6037 6.3066 4.6854 5.5279 3.7433 6.1113 7.4181 8.3444 6.8775 8.6689 3.9281 5.1348 5.5117 4.0403 1.4590 1.6694 2.7876 4.1194 5.3893 1.4723 1.4844 1.7022 2.6104 1.9099 2.1624 2.1744 4.4865 2.4810 1.5962 1.4450 9.2500 9.0993 3.9265 3.8544 1.3649 1.2638 1.3244 1.2964 1.3073 6.1657 11.4176 1.2302 3.3279 1.5779 6.1940 1.0963 1.0490 1.0428 1.0564 2.5379 1.0522 8.8297 6.7900 8.7748 1.0360 1.0365 1.0861 1.0604 1.0976 1.1023 1.0992 1.1070 1.1011 1.0910 1.0948 1.0935
irintensity: 0.8939 0.5765 0.7112 0.6263 0.1343 3.2127 0.4722 0.7857 3.4465 5.4471 0.3341 2.0134 5.2212 0.0493 0.9341 0.6206 3.5816 3.4237 13.7264 2.2126 0.5446 4.7968 7.1273 4.3435 1.6548 1.8925 6.8115 1.4715 3.8409 25.3719 26.4352 21.7345 11.3166 8.2303 3.1859 7.3028 4.0495 14.8891 7.4333 40.5490 16.5832 9.7896 97.5137 26.3197 5.9027 15.9369 77.9729 290.7782 15.3448 11.1344 7.8719 6.9493 14.0844 35.2031 316.6843 480.2397 157.3096 124.1090 2.0570 13.9025 29.7337 1.8326 1.1757 80.9480 84.4462 27.3292 42.3601 40.6410 25.4491 12.9375 27.6384 6.9650 14.5327 99.5310 12.0844 27.2567 134.0686 200.4975 15.2138 8.4779 12.7401 19.2392 26.9238 3.3491 16.2574 22.1518 8.0683 5.4594 7.8461 12.5322
temp: 298.150 k
press: 1.00000 atm
elementType: 8 8 8 8 8 8 8 7 7 6 6 6 6 6 6 6 6 6 6 6 1 1 1 1 1 1 1 1 1 1 1 1
symmnumber: 1
zpe: 601244.9 jmol-1
zpe.correction: 0.229002 hartree
zpe.thermalcorrener: 0.248808 hartree
zpe.thermalcorrenthalpy: 0.249752 hartree
zpe.thermalcorrgfe: 0.176926 hartree
zpe.sumelectzpe: -1060.766841 hartree
zpe.sumelectthermal: -1060.747035 hartree
zpe.sumelectthermalent: -1060.746090 hartree
zpe.sumelectthermalfe: -1060.818917 hartree
dipole: -8.0080 -1.8909 1.3814
dipole: 8.3433
quadrupole: -123.9279 -137.1113 -106.5367
quadrupole: 5.0840 5.0835 6.3346
quadrupole: -1.4026 -14.5860 15.9886 5.0840 5.0835 6.3346
hfenergy: -1060.9958429 hartree
pointgroup: C01 [X(C11H12N2O7)]
dipole: -3.0535254 -0.5796867 1.0558693 debye
polarizability: 232.4956619|-22.8801073|177.8547188|-25.8811038|-15.2647269|112.5757445 unknown
InChI: InChI=1S/C11H12N2O7/c1-3-19-11(14)7(2)20-10-5-4-8(12(15)16)6-9(10)13(17)18/h4-7H,3H2,1-2H3
charge 0 multiplicity 1
32 atoms
O  -0.949017 1.014036 0.631339
O  -3.633083 -0.063835 -0.117809
O  -2.760393 -1.851695 1.101789
O  2.148095 3.065497 -0.94092
O  -0.093883 2.760782 -1.245462
O  4.024736 -2.925389 -0.217521
O  4.782689 -1.041674 -1.263907
N  1.070829 2.351575 -0.88488
N  3.885606 -1.702775 -0.612198
C  -1.972292 0.442634 1.562183
C  0.18312 0.285152 0.320851
C  1.219519 0.953606 -0.40833
C  -2.789292 1.639114 2.04412
C  0.401868 -1.0652 0.715967
C  -2.819081 -0.625031 0.837976
C  2.436406 0.316088 -0.698769
C  2.614289 -1.018585 -0.293832
C  1.605534 -1.715885 0.407288
C  -4.498646 -0.998205 -0.918029
C  -5.812144 -1.270956 -0.183223
H  -1.455006 -0.0653 2.397675
H  -3.577157 1.304464 2.742112
H  -2.133735 2.353307 2.569093
H  -3.262385 2.143681 1.187826
H  -0.378142 -1.619274 1.244969
H  3.228526 0.851452 -1.228498
H  1.777221 -2.755189 0.699055
H  -4.649487 -0.451329 -1.861193
H  -3.930211 -1.927493 -1.096637
H  -6.471226 -1.882993 -0.82598
H  -5.634742 -1.826893 0.752503
H  -6.338321 -0.329285 0.04884
