program: Gaussian 09
title: 000299011
version: EM64L-G09RevD.01
frameworkgroup: C1[X(C18H11ClO2)]
method: RPBEPBE
basis: SDD
operation: Freq
keyword: #p
keyword: freq=noraman
keyword: PBEPBE/SDD
title: #p freq=noraman PBEPBE/SDD
converged: YES YES NO NO
title: Mulliken charges:
elementType: Cl O O C C C C C C C C C C C C C C C C C C H H H H H H H H H H H
charge: -0.047422 -0.249604 -0.195702 -0.307445 0.357502 0.314000 0.180533 0.064101 0.502198 -0.375070 0.086037 -0.369100 -0.402759 -0.361319 -0.435233 -0.228335 -0.347055 -0.221132 -0.218724 -0.267995 -0.254795 0.263434 0.267097 0.264391 0.238292 0.271326 0.264020 0.235264 0.236057 0.239073 0.237424 0.260941
chargesum: 0.00000
title: Mulliken charges with hydrogens summed into heavy atoms:
elementType: Cl O O C C C C C C C C C C C C C C C C C C
charge: -0.047422 -0.249604 -0.195702 -0.044011 0.357502 0.314000 0.180533 0.064101 0.502198 -0.107973 0.086037 -0.104709 -0.164468 -0.089993 -0.171212 0.006928 -0.347055 0.014925 0.020350 -0.030571 0.006146
polarizability: 2.84332364e+02 -2.17755547e+01 2.08206348e+02 -3.41240329e+00 1.73026340e+01 1.31656340e+02
1716.lowfreq: -7.7889 -2.0459 -0.0006 0.0018 0.0018 4.3999 30.4772 38.3377 52.8232
frequency: 30.4666 38.3159 52.8197 89.4261 134.4568 171.1369 175.5136 186.2809 199.8795 224.6264 251.5947 273.8100 295.6208 374.5470 412.8738 452.2420 461.3949 466.8577 471.2353 505.8540 520.8408 532.4659 555.4166 565.0479 599.2189 650.5397 658.7165 671.5997 697.5525 730.6595 740.4888 756.9133 779.5044 786.6746 797.3172 802.8785 817.9490 848.5699 870.1118 892.8152 901.2500 933.5196 941.1511 964.8740 969.1692 973.7471 996.5870 1003.3071 1021.1936 1038.7181 1066.2497 1089.0051 1098.4235 1167.6745 1169.4002 1179.7708 1185.7990 1202.1419 1205.1959 1237.6181 1247.0261 1256.3608 1280.1788 1295.1179 1367.8226 1387.5205 1402.4120 1410.3523 1422.4975 1450.6081 1453.8421 1458.9056 1507.4365 1580.2560 1598.3988 1603.5913 1617.9064 1626.9047 1705.7207 3010.5835 3136.5384 3137.7099 3144.5160 3149.8856 3158.0077 3160.9466 3165.6496 3172.7580 3176.3433 3177.9746
redmass: 7.3977 5.8086 6.7183 6.6667 5.4192 7.4801 4.1843 5.2276 9.1265 5.5485 5.4233 7.5609 5.9467 9.5843 3.1560 5.0910 5.1883 3.3892 4.4101 6.9196 7.4049 6.6819 6.8992 4.7145 4.1812 5.9273 5.1984 5.5894 5.6666 3.6475 1.5465 6.1280 4.7428 1.6909 1.8822 2.8825 2.9620 2.8931 4.3929 1.4096 1.4737 8.5822 1.4253 4.3527 1.5058 1.3961 1.3497 1.3351 2.1121 4.3311 2.3894 2.2405 2.1549 1.3338 1.3711 1.5114 1.3038 1.5491 1.6558 1.9747 1.7952 2.4504 1.5257 1.4031 2.2867 3.0448 7.8710 3.5720 3.4370 2.4846 2.4778 2.5004 4.1478 7.8959 5.6916 7.4407 7.2622 6.9196 12.9636 1.0835 1.0862 1.0862 1.0869 1.0900 1.0940 1.0955 1.0918 1.1005 1.0985 1.0973
irintensity: 1.0076 0.5704 1.0220 0.8096 1.4064 0.3569 2.1312 1.3572 0.5066 0.8336 0.6350 4.5258 7.5069 7.1616 1.4566 0.6393 0.9910 0.7563 4.0766 0.1882 1.6926 0.9695 2.0512 2.8834 4.3336 18.8338 4.8852 30.9431 28.9650 15.4760 4.1353 29.5120 1.7867 44.2614 62.7237 37.9780 18.1135 8.6223 29.1134 3.8892 6.8767 94.7749 1.0239 109.9877 12.7106 8.7573 1.8595 0.0585 1.3193 68.5149 8.4157 6.0257 8.5152 1.7644 4.1887 8.9926 7.8046 8.2108 14.9084 31.0340 9.1245 26.4710 3.9652 0.5022 42.4150 0.4544 1.1898 28.8251 5.1583 14.9641 1.7729 17.3066 32.9415 10.4759 7.8994 8.7282 21.3098 1.6251 449.7132 7.1886 1.2737 6.1647 7.0132 6.1577 17.9937 7.7562 1.9804 19.2030 13.2518 2.8277
temp: 298.150 k
press: 1.00000 atm
elementType: 17 8 8 6 6 6 6 6 6 6 6 6 6 6 6 6 6 6 6 6 6 1 1 1 1 1 1 1 1 1 1 1
symmnumber: 1
zpe: 616990.8 jmol-1
zpe.correction: 0.234999 hartree
zpe.thermalcorrener: 0.250974 hartree
zpe.thermalcorrenthalpy: 0.251919 hartree
zpe.thermalcorrgfe: 0.190394 hartree
zpe.sumelectzpe: -1301.626867 hartree
zpe.sumelectthermal: -1301.610892 hartree
zpe.sumelectthermalent: -1301.609948 hartree
zpe.sumelectthermalfe: -1301.671472 hartree
dipole: -0.9453 5.0116 -1.2106
dipole: 5.2417
quadrupole: -138.2031 -122.5036 -125.7102
quadrupole: 14.5702 -10.6647 8.1773
quadrupole: -9.3975 6.3020 3.0955 14.5702 -10.6647 8.1773
hfenergy: -1301.8618662 hartree
pointgroup: C01 [X(C18H11Cl1O2)]
dipole: -0.3300986 -1.9764257 0.4874242 debye
polarizability: 283.8961029|23.2922437|208.3943879|-5.1954613|16.3629925|131.9045611 unknown
InChI: InChI=1S/C18H11ClO2/c19-16-10-4-7-11-12(16)8-3-9-13(11)17-14-5-1-2-6-15(14)18(20)21-17/h1-10,17H
charge 0 multiplicity 1
32 atoms
Cl -5.419961 0.062362 1.113653
O  1.816148 1.565758 -1.227559
O  4.035938 2.184082 -0.813327
C  0.942772 0.379435 -0.976627
C  -0.338697 0.800941 -0.262921
C  1.839303 -0.576505 -0.185854
C  -1.531142 -0.006515 -0.379831
C  3.117912 0.005654 -0.051124
C  -2.722813 0.409463 0.347836
C  -0.346626 1.958517 0.520367
C  3.131633 1.3414 -0.698409
C  1.568579 -1.838107 0.375366
C  -1.591603 -1.195708 -1.184963
C  4.168041 -0.64483 0.627447
C  -2.68616 1.595084 1.149147
C  -1.519787 2.355011 1.227776
C  -3.895571 -0.407218 0.217055
C  2.616735 -2.500973 1.060061
C  3.904497 -1.915733 1.183625
C  -2.764835 -1.944777 -1.280748
C  -3.939223 -1.554334 -0.568393
H  0.713404 -0.030864 -1.977544
H  0.553738 2.577562 0.568019
H  0.576824 -2.29495 0.303986
H  -0.712832 -1.522994 -1.749546
H  5.148801 -0.166309 0.714251
H  -3.587475 1.896105 1.69061
H  -1.499246 3.267322 1.832792
H  2.428774 -3.483502 1.506912
H  4.69354 -2.454063 1.719093
H  -2.797846 -2.842197 -1.906959
H  -4.857121 -2.143621 -0.641393
