program: Gaussian 09
title: 000299031
version: EM64L-G09RevD.01
frameworkgroup: C1[X(C10H10N2O8)]
method: RPBEPBE
basis: SDD
operation: Freq
keyword: #p
keyword: freq=noraman
keyword: PBEPBE/SDD
title: #p freq=noraman PBEPBE/SDD
converged: YES YES NO NO
title: Mulliken charges:
elementType: O O O O O O O O N N C C C C C C C C C C H H H H H H H H H H
charge: -0.207729 -0.325006 -0.275626 -0.190312 -0.137163 -0.273447 -0.214876 -0.160459 0.030076 0.013326 -0.103924 0.319711 0.140813 0.046955 -0.316818 0.328936 -0.702387 -0.397469 0.233081 -0.502896 0.258962 0.289103 0.223817 0.251822 0.260024 0.292858 0.372431 0.252461 0.251254 0.242481
chargesum: 0.00000
title: Mulliken charges with hydrogens summed into heavy atoms:
elementType: O O O O O O O O N N C C C C C C C C C C
charge: -0.207729 0.047425 -0.275626 -0.190312 -0.137163 -0.273447 -0.214876 -0.160459 0.030076 0.013326 0.155039 0.319711 0.140813 0.046955 -0.027715 0.328936 0.033276 -0.104611 0.233081 0.243300
polarizability: 2.21749773e+02 1.13032888e+01 1.96842045e+02 -1.46420437e+01 7.74844032e+00 8.99393092e+01
1716.lowfreq: -6.7713 -0.0007 0.0002 0.0003 2.7985 6.5238 24.5121 29.7970 36.6398
frequency: 24.4646 29.7858 36.6186 42.3321 45.0113 85.3926 88.4724 106.2683 115.4541 152.0788 186.8420 196.2451 207.8447 229.5119 247.0917 259.5703 286.5058 302.7469 316.2238 343.8498 359.0778 396.9552 423.7700 447.1005 480.2338 494.4298 570.7828 609.3788 635.4756 653.4267 657.7518 671.9346 699.2550 710.7415 727.4681 739.0988 754.4856 801.8947 823.4532 845.3281 859.2589 928.1325 933.7293 972.6536 1013.3495 1037.7156 1072.2856 1076.7814 1107.9215 1115.2598 1124.9993 1141.1899 1150.1925 1180.2157 1203.0592 1219.6698 1275.6387 1314.7606 1322.9697 1334.8300 1358.2396 1375.3383 1393.4317 1397.0719 1423.1654 1424.1127 1453.9568 1461.3629 1462.6281 1472.3899 1511.5602 1591.3982 1599.9849 1663.9112 2633.0651 3007.8099 3011.9289 3038.7280 3109.9718 3117.4218 3124.7987 3161.2025 3172.0482 3188.0779
redmass: 7.1177 6.0128 5.6970 10.8276 11.8109 1.7035 2.0864 7.4529 5.2600 4.0695 9.6497 2.6363 3.0293 1.6183 4.1170 5.2908 6.2952 6.0305 8.5241 8.4300 8.8319 6.6916 7.2630 7.4552 5.0374 5.4702 9.0966 8.4143 4.5519 5.1873 5.5858 7.0679 7.4245 7.5383 9.3213 7.3514 11.9372 3.6091 1.5325 5.6235 7.4771 5.3001 1.0661 1.3622 2.0726 7.0537 2.8951 2.2110 3.9883 1.2817 7.3864 2.4276 1.4397 2.1508 3.1775 2.5532 2.7555 1.5268 1.6516 3.2813 7.6786 5.4084 3.8003 1.3773 2.8443 1.1721 1.0489 1.0423 1.0511 1.0543 2.5363 7.3601 4.7691 9.3723 1.0694 1.0353 1.0294 1.0859 1.0998 1.1051 1.1018 1.1054 1.0887 1.0966
irintensity: 1.5321 0.3030 0.1517 0.7227 0.6625 1.2901 1.5448 0.1940 0.8310 4.0802 1.4530 3.1748 3.5881 1.4243 0.8689 0.4777 9.5466 6.5492 7.2735 1.4620 7.1735 20.0919 2.0504 0.4826 3.1398 1.1102 8.2882 0.9708 13.0813 26.3019 41.3341 13.9140 6.1410 0.9139 15.2332 5.6183 8.2871 12.5788 39.2068 36.0210 10.4064 9.3407 134.3075 3.9176 17.5494 252.0750 77.1911 105.5450 196.0451 2.4509 145.3906 7.5280 15.0816 182.8430 325.5993 42.3736 5.9824 35.4346 57.5824 57.5997 76.3022 77.7210 29.7754 51.0004 292.4058 14.0397 15.4573 16.2611 10.9640 15.5618 58.9891 283.7161 250.8173 128.5885 332.8170 7.7835 22.6969 9.6470 12.3688 19.2468 8.2743 10.5355 0.9201 2.9446
temp: 298.150 k
press: 1.00000 atm
elementType: 8 8 8 8 8 8 8 8 7 7 6 6 6 6 6 6 6 6 6 6 1 1 1 1 1 1 1 1 1 1
symmnumber: 1
zpe: 534387.2 jmol-1
zpe.correction: 0.203537 hartree
zpe.thermalcorrener: 0.222968 hartree
zpe.thermalcorrenthalpy: 0.223913 hartree
zpe.thermalcorrgfe: 0.152827 hartree
zpe.sumelectzpe: -1096.678288 hartree
zpe.sumelectthermal: -1096.658857 hartree
zpe.sumelectthermalent: -1096.657913 hartree
zpe.sumelectthermalfe: -1096.728999 hartree
dipole: 8.5470 -2.5807 -2.4883
dipole: 9.2683
quadrupole: -122.7880 -124.7273 -114.5285
quadrupole: -17.2621 -3.7569 -3.7662
quadrupole: -2.1067 -4.0461 6.1528 -17.2621 -3.7569 -3.7662
hfenergy: -1096.8818254 hartree
pointgroup: C01 [X(C10H10N2O8)]
dipole: 3.3210773 -0.854949 -1.2393859 debye
polarizability: 215.7894262|11.4523372|198.9017277|-28.2874496|-2.9690113|93.8399734 unknown
InChI: InChI=1S/C10H10N2O8/c1-5(10(14)19-2)20-7-4-3-6(11(15)16)9(13)8(7)12(17)18/h3-5,13H,1-2H3
charge 0 multiplicity 1
30 atoms
O  1.373622 1.22003 -0.722616
O  -3.244762 0.805731 0.773002
O  3.726992 -1.43533 -0.449962
O  3.358491 0.160542 1.217179
O  -0.101736 3.276476 -0.299996
O  -2.118841 2.994623 0.691471
O  -2.900597 -3.298389 0.576594
O  -4.373453 -1.587362 0.239922
N  -1.019514 2.495383 0.114008
N  -3.179926 -2.055144 0.324821
C  2.665843 0.601419 -1.130893
C  0.28178 0.414956 -0.472606
C  -0.934353 1.048522 -0.030692
C  -2.112681 0.253703 0.280305
C  0.309765 -0.992911 -0.6225
C  -2.030271 -1.158481 0.083359
C  3.572542 1.783037 -1.485382
C  -0.83212 -1.756559 -0.34455
C  3.260164 -0.213243 0.033382
C  4.419982 -2.302836 0.542508
H  2.500576 -0.059744 -2.000602
H  1.218161 -1.500717 -0.952147
H  4.556507 1.416602 -1.82635
H  3.113126 2.374485 -2.29383
H  3.711908 2.429948 -0.604296
H  -0.816545 -2.844787 -0.4497
H  -3.054598 1.829415 0.885517
H  3.731855 -2.554042 1.366261
H  5.30131 -1.779252 0.947853
H  4.712074 -3.197378 -0.023357
