program: Gaussian 09
title: 000299017
version: EM64L-G09RevD.01
frameworkgroup: C1[X(C19H15BrO)]
method: RPBEPBE
basis: SDD
operation: Freq
keyword: #p
keyword: freq=noraman
keyword: PBEPBE/SDD
title: #p freq=noraman PBEPBE/SDD
converged: YES YES NO NO
title: Mulliken charges:
elementType: Br O C C C C C C C C C C C C C C C C C C C H H H H H H H H H H H H H H H
charge: -0.002150 -0.243027 -0.754145 0.378591 0.189860 0.436087 0.523069 -0.411591 0.100723 -0.399925 -0.451727 -0.375070 -0.249973 -0.432222 -0.320165 -0.281896 -0.218438 -0.233808 0.099986 -0.267341 -0.782538 0.282358 0.220874 0.288999 0.233107 0.251814 0.254674 0.229654 0.239396 0.233874 0.250888 0.233696 0.234513 0.236564 0.243493 0.261795
chargesum: 0.00000
title: Mulliken charges with hydrogens summed into heavy atoms:
elementType: Br O C C C C C C C C C C C C C C C C C C C
charge: -0.002150 -0.243027 -0.250912 0.378591 0.189860 0.436087 0.523069 -0.122592 0.100723 -0.166819 -0.199913 -0.120396 -0.020319 -0.432222 -0.080769 -0.048023 0.032450 -0.000112 0.099986 -0.032829 -0.040686
polarizability: 3.17005951e+02 1.87737622e+01 2.25261416e+02 1.43156867e+00 1.31025886e+01 1.44171030e+02
1716.lowfreq: -3.5424 -0.0007 -0.0005 -0.0004 2.0961 8.4488 23.6710 34.9075 38.6825
frequency: 23.5799 34.8557 38.6596 65.3717 81.1680 113.2372 141.0731 149.2653 165.7772 175.9857 184.4711 221.3443 253.7058 261.4355 290.5408 360.0079 392.0276 413.2522 447.6403 454.4507 468.1213 469.6284 490.1114 505.4456 521.4311 559.8756 578.5930 583.8783 599.4205 609.3908 665.3655 698.4919 739.5617 742.7911 769.1919 773.5177 781.6856 800.9456 808.3129 844.8393 852.6509 885.2718 903.4080 914.5711 949.2641 951.6296 962.5603 973.6949 997.9160 1002.0968 1018.2628 1019.0673 1041.8878 1064.8586 1067.7727 1090.0487 1122.7073 1167.5814 1176.0296 1183.7670 1187.2765 1195.3629 1209.2025 1244.5023 1250.6574 1256.5702 1289.5344 1319.8055 1362.1828 1369.0926 1377.6863 1379.1692 1403.0189 1419.6204 1429.6029 1448.1545 1450.8145 1461.0021 1475.5804 1480.9809 1506.2587 1564.6401 1575.6331 1590.3926 1593.9797 1607.8889 1620.0010 2987.0252 3030.7827 3076.5781 3106.4896 3124.7384 3130.0357 3136.1036 3137.0084 3141.8384 3153.8636 3153.9066 3158.0935 3168.6987 3169.0002 3175.1975
redmass: 5.3741 5.4853 5.1771 6.3074 5.4030 4.1271 7.7398 1.0520 7.7182 4.4188 4.3395 4.5241 4.5439 4.5531 7.3076 5.4275 3.4732 2.5882 4.5937 3.5821 3.3218 3.0381 4.1829 6.7650 5.4826 4.1346 3.9744 4.3018 3.1085 3.9040 4.9918 3.8530 4.4410 1.5407 1.5351 2.9547 5.6530 1.8005 2.4515 2.9823 3.1822 1.5104 1.4383 1.9366 1.7898 1.6908 1.3962 1.3434 1.3471 1.3680 1.8405 3.9611 3.1683 2.3266 2.2988 2.1863 1.9296 1.4065 1.1988 1.3877 1.1249 2.0422 1.4944 1.9383 2.0343 3.5080 1.5013 1.3898 2.3894 1.2328 5.3990 3.5677 3.2871 2.8118 2.0326 1.1324 2.3356 1.0601 2.0057 1.2618 3.6426 5.3641 7.7061 7.1505 5.8373 5.8296 6.6138 1.0386 1.0642 1.0946 1.0952 1.1005 1.0853 1.0870 1.0857 1.0890 1.0926 1.0941 1.0932 1.1002 1.0981 1.0974
irintensity: 0.5082 0.3059 1.6002 4.5894 0.1006 0.0228 1.7087 0.5077 1.4037 1.2839 1.8121 3.2012 4.5147 5.4554 2.2551 0.4036 2.3421 1.0665 2.1625 3.5333 2.5160 1.1022 3.1383 0.1711 0.6001 5.7011 26.1254 4.1472 5.6630 19.6404 12.6236 7.2558 13.7380 9.4461 49.3727 34.0322 2.3948 75.2642 34.0311 9.1333 8.3724 2.9460 1.5311 18.8374 12.8736 15.0356 1.0450 0.3979 0.4260 2.8467 3.9368 30.7779 4.9221 9.8671 7.2378 5.7567 3.9783 6.0209 1.9184 5.1420 3.1894 2.0029 3.5106 13.4506 14.2622 177.2226 2.0472 17.2136 46.6335 59.9235 5.2110 6.2684 36.6147 7.8762 6.8608 30.8580 1.9147 18.4393 28.6995 39.5757 42.1711 61.7923 6.4718 107.2965 7.6857 24.1864 0.2954 3.1095 19.9405 11.1368 5.3706 12.6918 0.7982 8.2373 3.5700 4.8708 1.9006 21.7654 19.7831 26.4822 14.3996 8.8661
temp: 298.150 k
press: 1.00000 atm
elementType: 35 8 6 6 6 6 6 6 6 6 6 6 6 6 6 6 6 6 6 6 6 1 1 1 1 1 1 1 1 1 1 1 1 1 1 1
symmnumber: 1
zpe: 732960.7 jmol-1
zpe.correction: 0.279170 hartree
zpe.thermalcorrener: 0.297276 hartree
zpe.thermalcorrenthalpy: 0.298220 hartree
zpe.thermalcorrgfe: 0.230892 hartree
zpe.sumelectzpe: -820.268093 hartree
zpe.sumelectthermal: -820.249987 hartree
zpe.sumelectthermalent: -820.249043 hartree
zpe.sumelectthermalfe: -820.316371 hartree
dipole: -4.0141 2.8896 -0.4498
dipole: 4.9664
quadrupole: -116.0459 -125.6352 -130.7097
quadrupole: -1.7050 6.5503 5.3294
quadrupole: 8.0844 -1.5049 -6.5794 -1.7050 6.5503 5.3294
hfenergy: -820.547263 hartree
pointgroup: C01 [X(C19H15Br1O1)]
dipole: -1.5701875 1.1522062 0.1575311 debye
polarizability: 312.4558771|20.8524629|223.7848175|-28.2806074|12.9657582|150.1977022 unknown
InChI: InChI=1S/C19H15BrO/c1-13(21)16-8-3-2-6-14(16)12-15-7-4-10-18-17(15)9-5-11-19(18)20/h2-11H,12H2,1H3
charge 0 multiplicity 1
36 atoms
Br 5.580575 -0.368058 -1.691899
O  -2.63505 -2.235565 1.101251
C  -0.586707 -0.130943 1.380473
C  0.579718 -0.631149 0.519337
C  1.832954 0.086382 0.411275
C  -1.67722 0.570428 0.557233
C  2.879713 -0.450808 -0.455897
C  0.405208 -1.826372 -0.192599
C  -3.005701 0.057156 0.372841
C  2.096354 1.301634 1.131744
C  2.643666 -1.666841 -1.172581
C  -1.362206 1.830426 -0.016495
C  1.430481 -2.34149 -1.036931
C  4.113933 0.283053 -0.540124
C  -3.956229 0.836199 -0.351783
C  3.315331 1.968428 1.016178
C  4.344465 1.460308 0.166331
C  -2.304796 2.574928 -0.753849
C  -3.450661 -1.287804 0.883601
C  -3.616926 2.076034 -0.921555
C  -4.943055 -1.526681 1.119707
H  -1.015533 -0.994116 1.908583
H  -0.229624 0.578404 2.147353
H  -0.541161 -2.365941 -0.082271
H  1.333601 1.712501 1.799689
H  3.429998 -2.061742 -1.822196
H  -0.349951 2.228886 0.112685
H  1.261405 -3.277122 -1.580804
H  -4.972163 0.452826 -0.489289
H  3.498784 2.889594 1.579035
H  5.297908 1.987799 0.077438
H  -2.019964 3.538762 -1.190157
H  -4.36093 2.644813 -1.489127
H  -5.468954 -1.680277 0.15767
H  -5.425855 -0.678772 1.635379
H  -5.057709 -2.444582 1.716457
