program: Gaussian 09
title: 000299015
version: EM64L-G09RevD.01
frameworkgroup: C1[X(C18H13BrO2)]
method: RPBEPBE
basis: SDD
operation: Freq
keyword: #p
keyword: freq=noraman
keyword: PBEPBE/SDD
title: #p freq=noraman PBEPBE/SDD
converged: YES YES NO NO
title: Mulliken charges:
elementType: Br O O C C C C C C C C C C C C C C C C C C H H H H H H H H H H H H H
charge: -0.000118 -0.438017 -0.269688 0.380168 -0.760493 0.193965 0.447418 0.523932 -0.408175 -0.399949 0.039995 -0.451109 -0.248613 -0.432504 -0.369207 -0.281572 -0.217370 -0.307498 -0.231930 -0.239154 0.088609 0.224764 0.289984 0.276537 0.233300 0.252430 0.229977 0.253729 0.234704 0.251437 0.279018 0.233720 0.236871 0.384839
chargesum: 0.00000
title: Mulliken charges with hydrogens summed into heavy atoms:
elementType: Br O O C C C C C C C C C C C C C C C C C C
charge: -0.000118 -0.053177 -0.269688 0.380168 -0.245745 0.193965 0.447418 0.523932 -0.131638 -0.166650 0.039995 -0.198679 -0.018636 -0.432504 -0.115478 -0.046867 0.034067 -0.028481 0.001789 -0.002283 0.088609
polarizability: 3.04988217e+02 -2.01966526e+01 2.20682828e+02 -2.64637034e+00 1.21519675e+01 1.37765626e+02
1716.lowfreq: -4.2371 -0.0008 -0.0007 -0.0003 3.5700 7.3570 21.3161 31.2994 35.1194
frequency: 21.2765 31.2846 35.1040 52.0673 80.9442 117.8725 140.0257 165.4737 175.0040 185.2230 226.1135 258.6727 262.6582 291.1573 373.5227 396.7600 417.0672 450.2612 459.2818 469.9919 471.2207 494.9490 506.7081 523.9995 559.8903 581.2950 594.5923 604.2505 610.9070 667.4187 687.6375 718.7972 742.5930 743.1332 777.6429 781.4404 795.0069 801.2811 812.2557 845.7108 853.2241 895.4303 904.5348 919.9212 943.9738 973.6733 978.7339 997.1371 998.6377 1004.0655 1020.5224 1050.0202 1066.8440 1089.8922 1105.6846 1158.5713 1167.6957 1174.8208 1183.3947 1186.6833 1196.0439 1209.5266 1244.6710 1250.1292 1289.9486 1304.6155 1326.5408 1362.0915 1378.8211 1383.3955 1403.1432 1419.0421 1430.6617 1450.8477 1479.0172 1486.3252 1506.1812 1573.9596 1577.6257 1593.3602 1607.1109 1619.8551 1629.6040 3034.5184 3103.9078 3132.1722 3135.8109 3137.7966 3147.9902 3152.9555 3158.7657 3162.0527 3169.3711 3175.5747 3183.6697 3525.2825
redmass: 7.2037 7.2622 6.9226 8.4383 5.9965 4.5686 8.6625 7.5793 4.4796 4.3980 4.6553 6.2485 4.6676 8.1093 7.4207 3.0954 2.8441 4.5538 3.4424 3.6161 3.4655 4.8386 6.5598 5.6492 4.2008 4.8052 1.3852 3.1096 4.4787 4.7296 3.9586 3.4006 1.5047 4.3397 2.3560 5.6252 2.3311 1.4881 3.4028 3.1854 3.3002 1.5005 1.4554 1.9460 1.4049 1.3476 1.3902 1.4117 4.0680 1.4110 4.0736 2.4911 2.4461 2.2041 2.0279 1.7871 1.4215 1.1581 1.3864 1.1374 2.1288 1.4984 1.9482 1.9729 1.5404 2.0088 1.5588 2.3485 3.4831 6.3753 3.2836 2.8492 2.1334 2.4012 2.2455 1.1923 3.6050 7.0812 6.8964 5.6006 6.1653 6.8267 7.1348 1.0632 1.0966 1.0860 1.0870 1.0857 1.0909 1.0924 1.0932 1.0970 1.0981 1.0975 1.0965 1.0641
irintensity: 0.0534 0.3197 0.6013 1.1654 0.1602 0.1078 1.0482 0.6447 1.9983 1.5278 3.1968 1.5620 5.8490 3.6817 5.8277 1.7406 9.7580 3.1036 1.3595 1.3979 3.3105 10.0839 2.3497 1.8441 4.3016 17.0515 96.1034 25.0352 42.0061 3.2729 47.0330 49.5474 7.8643 16.0007 46.0900 4.1862 13.6100 100.9061 11.1720 8.2246 9.0478 3.3513 2.3509 25.9942 0.1434 1.1490 5.5268 16.1611 283.8599 17.3150 18.2305 11.5527 5.5620 17.5073 68.4980 74.1797 12.0875 1.8280 3.7082 2.5076 3.1459 7.1123 8.8059 3.4364 13.1038 72.6214 25.4512 51.1116 6.5421 4.5023 33.3670 7.0776 4.4629 2.1965 71.2237 16.3938 41.1207 10.8185 25.9464 16.5596 8.2070 19.2979 253.0703 18.6257 7.5095 1.3842 6.3084 4.0781 12.8688 1.5576 19.5842 17.1962 15.9078 8.5622 8.3788 55.9707
temp: 298.150 k
press: 1.00000 atm
elementType: 35 8 8 6 6 6 6 6 6 6 6 6 6 6 6 6 6 6 6 6 6 1 1 1 1 1 1 1 1 1 1 1 1 1
symmnumber: 1
zpe: 673176.6 jmol-1
zpe.correction: 0.256399 hartree
zpe.thermalcorrener: 0.273855 hartree
zpe.thermalcorrenthalpy: 0.274799 hartree
zpe.thermalcorrgfe: 0.208347 hartree
zpe.sumelectzpe: -856.203630 hartree
zpe.sumelectthermal: -856.186174 hartree
zpe.sumelectthermalent: -856.185230 hartree
zpe.sumelectthermalfe: -856.251682 hartree
dipole: 2.8292 1.8852 -0.2428
dipole: 3.4084
quadrupole: -124.1108 -118.3589 -130.0704
quadrupole: -4.4700 -4.8825 4.5178
quadrupole: 0.0692 5.8211 -5.8903 -4.4700 -4.8825 4.5178
hfenergy: -856.4600294 hartree
pointgroup: C01 [X(C18H13Br1O2)]
dipole: 1.1106298 -0.7482306 -0.0697192 debye
polarizability: 303.37182|21.533336|219.5948437|-17.2939892|12.4405562|140.4700073 unknown
InChI: InChI=1S/C18H13BrO2/c19-17-10-4-8-14-12(6-3-9-16(14)17)11-13-5-1-2-7-15(13)18(20)21/h1-10,20H,11H2
charge 0 multiplicity 1
34 atoms
Br -5.568524 0.395177 1.485549
O  4.908107 1.510796 -0.482104
O  2.805891 2.255857 -1.069484
C  -0.474028 0.652004 -0.50009
C  0.736288 0.14236 -1.292257
C  -1.727588 -0.070107 -0.43825
C  1.779479 -0.544134 -0.3993
C  -2.815684 0.474999 0.371118
C  -0.339192 1.860136 0.198448
C  -1.951392 -1.297713 -1.15077
C  3.078531 -0.009476 -0.113197
C  -2.618825 1.704277 1.077082
C  -1.404585 2.384306 0.985654
C  -4.048333 -0.265095 0.411843
C  1.449415 -1.807303 0.15872
C  -3.170734 -1.970066 -1.079642
C  -4.239697 -1.455197 -0.284865
C  3.993808 -0.753407 0.688372
C  2.353384 -2.528862 0.963672
C  3.638919 -2.001366 1.227703
C  3.518119 1.327409 -0.604016
H  0.423556 -0.577546 -2.067932
H  1.192781 0.99868 -1.809036
H  0.605995 2.408224 0.123357
H  -1.157475 -1.713071 -1.778284
H  -3.435787 2.105439 1.683631
H  -1.265997 3.329973 1.520589
H  0.456957 -2.225789 -0.039578
H  -3.323428 -2.900844 -1.635738
H  -5.193025 -1.987472 -0.229922
H  4.981694 -0.32793 0.881074
H  2.058437 -3.498292 1.380608
H  4.351544 -2.555359 1.847404
H  5.127686 2.42799 -0.799159
