program: Gaussian 09
title: 000299013
version: EM64L-G09RevD.01
frameworkgroup: C1[X(C19H15ClO)]
method: RPBEPBE
basis: SDD
operation: Freq
keyword: #p
keyword: freq=noraman
keyword: PBEPBE/SDD
title: #p freq=noraman PBEPBE/SDD
converged: YES YES NO NO
title: Mulliken charges:
elementType: Cl O C C C C C C C C C C C C C C C C C C C H H H H H H H H H H H H H H H
charge: -0.060632 -0.243078 -0.752848 0.383285 0.191296 0.434961 0.496642 -0.411703 0.101412 -0.405976 -0.444879 -0.375431 -0.233826 -0.346518 -0.320149 -0.275173 -0.260515 -0.233305 0.100329 -0.267463 -0.782553 0.281948 0.220805 0.288366 0.232908 0.260457 0.254740 0.228453 0.239362 0.232172 0.257180 0.233546 0.234439 0.236560 0.243432 0.261754
chargesum: 0.00000
title: Mulliken charges with hydrogens summed into heavy atoms:
elementType: Cl O C C C C C C C C C C C C C C C C C C C
charge: -0.060632 -0.243078 -0.250095 0.383285 0.191296 0.434961 0.496642 -0.123337 0.101412 -0.173067 -0.184422 -0.120691 -0.005373 -0.346518 -0.080787 -0.043000 -0.003336 0.000241 0.100329 -0.033024 -0.040806
polarizability: 2.98440970e+02 2.04834649e+01 2.21422567e+02 1.67493966e+00 1.27777221e+01 1.41447443e+02
1716.lowfreq: -5.2887 -0.0007 0.0010 0.0017 1.5991 8.5383 25.8711 37.2444 40.6211
frequency: 25.7490 37.1955 40.5604 67.4703 86.8443 115.9431 144.6129 148.9372 177.0338 189.6834 201.4872 228.7908 258.9632 264.6792 357.3000 369.0171 392.6219 412.9626 449.7018 455.5307 468.4984 471.5446 492.5354 506.4348 526.5628 562.1371 579.4902 586.8010 600.1977 610.8611 666.8873 698.5893 742.9073 750.8923 768.7708 777.6600 786.7244 800.3962 808.1471 842.7171 852.8674 884.9690 899.8189 914.0655 949.0017 951.2345 962.0497 971.8901 997.7006 1001.0849 1018.4423 1026.4611 1042.4874 1064.3872 1067.2809 1092.0431 1122.7040 1168.3076 1175.6307 1183.1114 1186.5112 1195.2761 1208.4883 1243.6491 1251.3552 1256.8252 1289.8744 1318.7983 1365.9817 1369.3861 1378.5459 1383.9320 1404.3517 1422.4494 1429.7592 1448.0520 1452.3056 1460.7087 1475.4536 1479.8664 1507.9272 1564.7002 1578.5804 1590.5117 1594.5718 1607.9753 1623.5264 2987.2654 3028.8066 3076.7988 3105.4789 3124.6913 3129.8086 3135.6324 3136.9287 3141.5439 3153.5400 3154.0699 3158.1451 3168.6946 3169.9448 3174.8217
redmass: 4.8728 6.3683 4.9625 5.9243 5.3865 4.1233 5.4913 1.1100 4.2340 4.6079 7.4430 5.0491 4.1171 4.6431 5.5095 8.7310 3.4615 2.4624 4.5793 3.7595 3.3886 3.1074 4.2236 6.8691 5.5279 4.2355 3.6963 4.3641 3.1826 4.0431 4.9719 3.8424 1.5552 4.1479 1.4592 3.7433 5.1156 1.9302 2.2762 2.7351 3.3548 1.5173 1.4318 1.9491 1.7567 1.7099 1.3979 1.3370 1.3470 1.3527 1.8314 3.7623 3.2053 2.3480 2.2069 2.2605 1.9320 1.3414 1.1946 1.3791 1.1270 2.0865 1.5324 1.9313 2.0535 3.4848 1.5005 1.3933 2.4562 1.2460 5.4039 3.2955 3.2953 3.0383 2.0408 1.1242 2.4204 1.0589 1.8111 1.3471 3.7686 5.3658 7.7908 7.3121 5.7085 5.8272 6.8154 1.0385 1.0645 1.0946 1.0951 1.1005 1.0854 1.0871 1.0857 1.0890 1.0941 1.0928 1.0931 1.1003 1.0979 1.0976
irintensity: 0.3018 0.5228 1.7844 4.4785 0.1147 0.0171 1.6469 0.8018 1.7678 1.9131 1.6689 2.3321 4.0447 4.4816 2.1973 3.9976 2.0740 1.3876 2.1256 3.7567 0.6164 2.1088 3.0459 0.1392 0.5571 7.1139 21.2470 3.9571 7.0989 17.6412 10.8143 7.0008 4.6105 10.9470 54.2002 19.4587 20.9785 70.6450 40.6436 10.9210 5.9057 2.6606 1.2211 17.7148 12.0753 15.6194 1.0228 0.6430 0.4484 2.5580 3.9619 25.8256 5.6103 9.8570 9.3900 4.2810 4.1604 4.8812 2.4418 3.7607 3.4932 1.9018 2.9389 10.9021 16.0093 175.4477 2.0989 17.1420 33.2699 68.3799 5.0528 7.3573 33.3737 6.0596 6.5623 30.7651 1.3948 18.2854 23.1508 42.2534 36.8049 63.5707 4.7500 109.4103 6.6362 23.5719 1.1548 3.1072 19.8625 11.1378 5.1976 12.6724 0.9510 9.2134 4.5337 4.4758 21.4975 2.6195 18.9309 25.3067 14.7477 7.2181
temp: 298.150 k
press: 1.00000 atm
elementType: 17 8 6 6 6 6 6 6 6 6 6 6 6 6 6 6 6 6 6 6 6 1 1 1 1 1 1 1 1 1 1 1 1 1 1 1
symmnumber: 1
zpe: 734237.4 jmol-1
zpe.correction: 0.279656 hartree
zpe.thermalcorrener: 0.297520 hartree
zpe.thermalcorrenthalpy: 0.298464 hartree
zpe.thermalcorrgfe: 0.232407 hartree
zpe.sumelectzpe: -1266.869655 hartree
zpe.sumelectthermal: -1266.851791 hartree
zpe.sumelectthermalent: -1266.850846 hartree
zpe.sumelectthermalfe: -1266.916904 hartree
dipole: -3.8871 3.0286 -0.1945
dipole: 4.9315
quadrupole: -117.7895 -123.5788 -128.3055
quadrupole: 0.4654 6.7283 4.7921
quadrupole: 5.4351 -0.3542 -5.0809 0.4654 6.7283 4.7921
hfenergy: -1267.1493108 hartree
pointgroup: C01 [X(C19H15Cl1O1)]
dipole: -1.540046 1.1677464 0.1703473 debye
polarizability: 295.2169825|23.557614|221.4479908|-19.7781629|11.5459996|144.6460066 unknown
InChI: InChI=1S/C19H15ClO/c1-13(21)16-8-3-2-6-14(16)12-15-7-4-10-18-17(15)9-5-11-19(18)20/h2-11H,12H2,1H3
charge 0 multiplicity 1
36 atoms
Cl 5.454101 -0.349457 -1.635836
O  -2.627707 -2.240602 1.090298
C  -0.577104 -0.13931 1.378547
C  0.585667 -0.634483 0.509957
C  1.839347 0.081956 0.404223
C  -1.669821 0.568738 0.564115
C  2.879534 -0.452834 -0.469222
C  0.40884 -1.824073 -0.211575
C  -2.999014 0.057504 0.379364
C  2.112331 1.292196 1.130905
C  2.644894 -1.662002 -1.197234
C  -1.355786 1.833038 -0.00064
C  1.430599 -2.335201 -1.063397
C  4.113701 0.275432 -0.551766
C  -3.95103 0.842316 -0.337077
C  3.334983 1.953829 1.013928
C  4.358856 1.445957 0.157323
C  -2.299864 2.583417 -0.730097
C  -3.443357 -1.290733 0.881715
C  -3.612585 2.086215 -0.898459
C  -4.935276 -1.530508 1.12023
H  -1.004791 -1.005212 1.903124
H  -0.215536 0.565056 2.147992
H  -0.537967 -2.363231 -0.102687
H  1.354819 1.703611 1.804593
H  3.432549 -2.048174 -1.850447
H  -0.343028 2.23001 0.129402
H  1.256903 -3.266387 -1.613559
H  -4.967485 0.460392 -0.474858
H  3.524268 2.870738 1.58177
H  5.317166 1.963977 0.063613
H  -2.015774 3.55046 -1.159761
H  -4.357747 2.659495 -1.459967
H  -5.463437 -1.678494 0.158538
H  -5.416632 -0.685493 1.641926
H  -5.048617 -2.451841 1.71192
